program: Orca
programVersion: 5.0.2
elementType: F F F F F F F O O N N N N C C C C C C C C C C C C C C C C C C C H H H H H H H H H H H H H H H
charge: 0
multiplicity: 1
keywords: wb97x-d3
keywords: def2-TZVPP
keywords: def2/J RIJCOSX
keywords: DEFGRID2
keywords: scfconv7
keywords: smallprint printgap noloewdin
keywords: NOSOSCF
formula: C19H15F7N4O2
InChI: InChI=1/C19H15F7N4O2/c1-11(31)30-15-5-4-14(17(20,18(21,22)23)19(24,25)26)7-13(15)10-29(16(30)32)28-9-12-3-2-6-27-8-12/h2-8,28H,9-10H2,1H3
47 atoms
F  3.764983 2.568262 -0.024238
F  5.247699 0.619313 0.791149
F  3.773096 -0.898747 0.423639
F  3.431544 0.598073 1.932848
F  3.170883 1.995682 -2.543407
F  3.200912 -0.127051 -2.189449
F  4.990933 1.037754 -1.923495
O  -4.162457 0.742197 -1.202951
O  -2.435281 2.975337 1.802971
N  -2.467681 -0.688935 -0.750876
N  -2.431491 1.434559 0.159932
N  -2.949099 -1.687555 -1.583465
N  -2.14762 -4.888395 1.089957
C  -0.377015 0.236902 -0.023335
C  -1.258725 -0.968772 0.007221
C  -1.016942 1.464085 0.052897
C  1.750336 1.342188 -0.170731
C  3.257793 1.322477 -0.302141
C  0.998942 0.171308 -0.145685
C  -0.281863 2.637423 -0.024537
C  1.097621 2.570115 -0.127265
C  -3.117518 0.484308 -0.643026
C  3.942092 0.387211 0.724551
C  3.670386 1.041651 -1.764031
C  -3.080266 2.219476 1.112048
C  -4.065546 -2.43501 -1.009862
C  -3.607078 -3.20725 0.193556
C  -4.564672 2.075133 1.272912
C  -4.061849 -2.918203 1.471357
C  -2.647633 -4.209329 0.068802
C  -3.551781 -3.626753 2.550271
C  -2.594044 -4.596388 2.30796
H  -0.773147 -1.825292 -0.453234
H  -1.503303 -1.240014 1.039432
H  1.450623 -0.808686 -0.211773
H  -0.762627 3.604016 -0.022617
H  1.646983 3.498521 -0.181079
H  -3.206336 -1.283516 -2.476476
H  -4.404784 -3.115397 -1.793794
H  -4.918822 -1.803213 -0.743387
H  -5.095559 2.515061 0.430462
H  -4.85528 2.604969 2.176609
H  -4.882914 1.037846 1.361882
H  -4.803751 -2.143251 1.624536
H  -2.261148 -4.464225 -0.913512
H  -3.881902 -3.425225 3.560466
H  -2.167885 -5.162385 3.129003
elementType: F O N C H
totalener: -1801.68075199 hartree
nucrepener: 3494.64321800 hartree
electener: -5296.32396999 hartree
oneelecener: -9428.63911418 hartree
twoeener: 4132.31514419 hartree
cpcmener: -0.03624115 hartree
kineticenergy: 1795.00875822 hartree
xcener: -158.789741653255 hartree
chargesum: 0.0000000
charge: -0.195961 -0.153893 -0.158093 -0.155876 -0.156844 -0.156606 -0.156565 -0.473699 -0.455807 0.003322 -0.087150 -0.208146 -0.362813 -0.062923 -0.058352 0.115532 -0.046960 0.186116 -0.096037 -0.211655 -0.110955 0.338932 0.482787 0.464594 0.351282 -0.058829 0.022839 -0.246385 -0.164798 -0.003794 -0.135606 0.006587 0.112571 0.118480 0.140782 0.150112 0.144870 0.145235 0.117814 0.109327 0.115675 0.101923 0.114330 0.147085 0.127000 0.155939 0.144610
qa: -0.1960 -0.1539 -0.1581 -0.1559 -0.1568 -0.1566 -0.1566 -0.4737 -0.4558 0.0033 -0.0871 -0.2081 -0.3628 -0.0629 -0.0584 0.1155 -0.0470 0.1861 -0.0960 -0.2117 -0.1110 0.3389 0.4828 0.4646 0.3513 -0.0588 0.0228 -0.2464 -0.1648 -0.0038 -0.1356 0.0066 0.1126 0.1185 0.1408 0.1501 0.1449 0.1452 0.1178 0.1093 0.1157 0.1019 0.1143 0.1471 0.1270 0.1559 0.1446
va: 1.1017 1.1690 1.1567 1.1606 1.1620 1.1606 1.1651 2.0406 2.0398 3.1385 3.1193 2.8847 3.0722 3.9416 3.8974 3.7752 3.6829 4.0557 4.0000 4.0456 4.0144 4.3597 4.4764 4.4783 4.0600 3.9131 3.5539 3.8917 3.9445 4.0414 3.8977 4.0038 1.0165 0.9812 1.0280 1.0168 1.0138 1.0273 1.0051 1.0080 1.0128 1.0192 1.0017 1.0024 1.0231 0.9913 0.9992
dispcorr: -0.026944492 hartree
energy: -1801.707696484281
dipole: -63.68245 61.91547 -1.76698 -16.67203 15.70424 -0.96780 9.39041 -9.50229 -0.11188
magnitude: 2.01776 au
magnitude: 5.12874 debye
