program: Orca
programVersion: 5.0.2
elementType: F F F F F F F O O N N N N C C C C C C C C C C C C C C C C C C C H H H H H H H H H H H H H H H
charge: 0
multiplicity: 1
keywords: wb97x-d3
keywords: def2-TZVPP
keywords: def2/J RIJCOSX
keywords: DEFGRID2
keywords: scfconv7
keywords: smallprint printgap noloewdin
keywords: NOSOSCF
formula: C19H15F7N4O2
InChI: InChI=1/C19H15F7N4O2/c1-11(31)30-15-5-4-14(17(20,18(21,22)23)19(24,25)26)7-13(15)10-29(16(30)32)28-9-12-3-2-6-27-8-12/h2-8,28H,9-10H2,1H3
47 atoms
F  3.604695 -0.638417 -0.237212
F  4.150719 2.784364 -0.692372
F  3.404241 1.394716 -2.156747
F  5.296853 1.042699 -1.205215
F  5.250644 0.627516 1.514902
F  3.367645 0.011313 2.337252
F  3.738437 2.096965 1.945842
O  -4.035283 0.719663 1.519976
O  -2.330086 2.859925 -1.561643
N  -2.484239 -0.828094 0.950802
N  -2.340278 1.303722 0.066638
N  -3.014594 -1.807142 1.777403
N  -4.040311 -3.444283 -2.358461
C  -0.375154 -0.051554 0.097746
C  -1.345305 -1.189418 0.120383
C  -0.923562 1.220967 0.078249
C  1.838195 0.891431 0.095718
C  3.336703 0.669695 0.085119
C  0.999636 -0.218018 0.111922
C  -0.096949 2.334976 0.118327
C  1.277158 2.166308 0.121569
C  -3.045563 0.394501 0.897982
C  4.063078 1.494062 -1.007523
C  3.941403 0.86367 1.493847
C  -2.986868 2.150111 -0.833993
C  -4.234757 -2.415632 1.252749
C  -3.922073 -3.222403 0.028087
C  -4.485754 2.125582 -0.900986
C  -3.149256 -4.376761 0.09892
C  -4.336433 -2.808108 -1.230387
C  -2.836804 -5.051837 -1.067385
C  -3.303082 -4.542635 -2.2718
H  -1.670523 -1.435722 -0.896295
H  -0.897273 -2.082498 0.548999
H  1.3927 -1.225184 0.125443
H  -0.501787 3.334615 0.16074
H  1.885053 3.058777 0.146347
H  -3.174735 -1.414696 2.698036
H  -5.021657 -1.687726 1.031235
H  -4.612706 -3.062622 2.046842
H  -4.890744 1.117591 -0.983958
H  -4.788476 2.692034 -1.77854
H  -4.927852 2.591519 -0.021793
H  -2.795802 -4.740368 1.056582
H  -4.939704 -1.910024 -1.328107
H  -2.240952 -5.954495 -1.051503
H  -3.068561 -5.046044 -3.20338
elementType: F O N C H
totalener: -1801.68152981 hartree
nucrepener: 3473.01110176 hartree
electener: -5274.69263157 hartree
oneelecener: -9385.60007005 hartree
twoeener: 4110.90743849 hartree
cpcmener: -0.03625635 hartree
kineticenergy: 1794.98269151 hartree
xcener: -158.784660175040 hartree
chargesum: -0.0000000
charge: -0.197639 -0.157345 -0.155596 -0.154591 -0.156884 -0.157404 -0.156250 -0.472996 -0.455521 0.000761 -0.085361 -0.204947 -0.362422 -0.057287 -0.052512 0.120497 -0.044751 0.186373 -0.102951 -0.213080 -0.116857 0.335592 0.482545 0.464647 0.351763 -0.061292 0.031148 -0.244566 -0.148515 -0.025085 -0.151005 0.017886 0.118451 0.109343 0.136862 0.151084 0.149152 0.145252 0.112694 0.115304 0.114055 0.101602 0.115657 0.144980 0.129234 0.155024 0.144951
qa: -0.1976 -0.1573 -0.1556 -0.1546 -0.1569 -0.1574 -0.1563 -0.4730 -0.4555 0.0008 -0.0854 -0.2049 -0.3624 -0.0573 -0.0525 0.1205 -0.0448 0.1864 -0.1030 -0.2131 -0.1169 0.3356 0.4825 0.4646 0.3518 -0.0613 0.0311 -0.2446 -0.1485 -0.0251 -0.1510 0.0179 0.1185 0.1093 0.1369 0.1511 0.1492 0.1453 0.1127 0.1153 0.1141 0.1016 0.1157 0.1450 0.1292 0.1550 0.1450
va: 1.0986 1.1582 1.1603 1.1681 1.1645 1.1610 1.1616 2.0404 2.0402 3.1484 3.1183 2.8820 3.0670 3.9182 3.9034 3.7792 3.6653 4.0424 3.9884 4.0615 4.0282 4.3635 4.4836 4.4844 4.0598 3.9247 3.5158 3.8904 3.9476 4.0424 3.9118 3.9925 0.9817 1.0164 1.0255 1.0164 1.0161 1.0263 1.0087 1.0052 1.0022 1.0194 1.0128 1.0099 1.0147 0.9919 0.9986
dispcorr: -0.026833379 hartree
energy: -1801.708363190739
dipole: -64.67543 64.02487 -0.65056 -21.52276 19.52641 -1.99635 -2.75435 4.15989 1.40554
magnitude: 2.52670 au
magnitude: 6.42236 debye
