program: Orca
programVersion: 5.0.2
elementType: F F F F F F F O O N N N N C C C C C C C C C C C C C C C C C C C H H H H H H H H H H H H H H H
charge: 0
multiplicity: 1
keywords: wb97x-d3
keywords: def2-TZVPP
keywords: def2/J RIJCOSX
keywords: DEFGRID2
keywords: scfconv7
keywords: smallprint printgap noloewdin
keywords: NOSOSCF
formula: C19H15F7N4O2
InChI: InChI=1/C19H15F7N4O2/c1-11(31)30-15-5-4-14(17(20,18(21,22)23)19(24,25)26)7-13(15)10-29(16(30)32)28-9-12-3-2-6-27-8-12/h2-8,28H,9-10H2,1H3
47 atoms
F  3.518374 1.950943 -0.281579
F  3.028709 -0.612532 2.041949
F  2.905695 1.506672 2.406716
F  4.702516 0.654819 1.596548
F  2.820512 0.09425 -2.072057
F  2.548819 -1.406865 -0.553039
F  4.492831 -0.542045 -0.884531
O  -4.635947 0.630999 -0.79068
O  -2.541049 4.079768 0.0168
N  -3.101147 -0.328162 0.568374
N  -2.777866 1.84596 -0.154793
N  -3.796381 -1.52075 0.667036
N  -0.496375 -4.212548 0.611341
C  -0.922096 0.63482 0.731894
C  -1.973822 -0.130606 1.465102
C  -1.373892 1.644747 -0.10323
C  1.34547 1.111669 0.102321
C  2.832698 0.840724 0.148972
C  0.429165 0.351783 0.820994
C  -0.472523 2.371282 -0.866845
C  0.88165 2.109368 -0.75061
C  -3.595642 0.686355 -0.168987
C  3.376566 0.584672 1.574491
C  3.189955 -0.280362 -0.851245
C  -3.298243 3.137741 -0.041179
C  -3.604985 -2.40122 -0.477135
C  -2.209302 -2.955881 -0.505895
C  -4.784562 3.320293 0.045806
C  -1.360221 -2.754441 -1.583354
C  -1.715242 -3.696378 0.565944
C  -0.082157 -3.294548 -1.551875
C  0.302089 -4.01313 -0.433084
H  -1.608085 -1.107253 1.769985
H  -2.285271 0.404068 2.369934
H  0.729187 -0.464357 1.46341
H  -0.803328 3.125796 -1.56434
H  1.562808 2.696517 -1.349527
H  -4.779976 -1.330057 0.817728
H  -3.830552 -1.920456 -1.434947
H  -4.326644 -3.211953 -0.354123
H  -5.25234 2.665011 0.778939
H  -5.260308 3.139193 -0.916729
H  -4.974195 4.351915 0.332931
H  -1.693765 -2.18182 -2.440822
H  -2.345672 -3.87667 1.431374
H  0.601665 -3.162503 -2.379156
H  1.292697 -4.450395 -0.375373
elementType: F O N C H
totalener: -1801.68141961 hartree
nucrepener: 3614.61941627 hartree
electener: -5416.30083588 hartree
oneelecener: -9668.89348031 hartree
twoeener: 4252.59264443 hartree
cpcmener: -0.03520242 hartree
kineticenergy: 1795.01370542 hartree
xcener: -158.790671377484 hartree
chargesum: -0.0000000
charge: -0.196661 -0.158279 -0.154890 -0.153813 -0.158978 -0.155285 -0.156083 -0.475993 -0.453489 -0.012221 -0.094722 -0.211261 -0.360256 -0.062571 -0.073899 0.144641 -0.005957 0.200698 -0.155085 -0.209400 -0.134070 0.346757 0.482816 0.465055 0.356417 -0.017912 0.048045 -0.248999 -0.187981 -0.042117 -0.132395 0.004296 0.124976 0.126784 0.143007 0.151186 0.145903 0.144334 0.106189 0.116937 0.116716 0.114724 0.101992 0.146636 0.126468 0.154362 0.143380
qa: -0.1967 -0.1583 -0.1549 -0.1538 -0.1590 -0.1553 -0.1561 -0.4760 -0.4535 -0.0122 -0.0947 -0.2113 -0.3603 -0.0626 -0.0739 0.1446 -0.0060 0.2007 -0.1551 -0.2094 -0.1341 0.3468 0.4828 0.4651 0.3564 -0.0179 0.0480 -0.2490 -0.1880 -0.0421 -0.1324 0.0043 0.1250 0.1268 0.1430 0.1512 0.1459 0.1443 0.1062 0.1169 0.1167 0.1147 0.1020 0.1466 0.1265 0.1544 0.1434
va: 1.1013 1.1570 1.1621 1.1691 1.1590 1.1586 1.1665 2.0404 2.0414 3.1293 3.1282 2.8918 3.0483 3.8460 3.9239 3.7626 3.6577 4.0445 3.9622 4.0558 4.0343 4.3591 4.4824 4.4602 4.0520 3.8750 3.5250 3.8918 3.9656 4.0542 3.8578 3.9935 1.0039 0.9932 1.0267 1.0155 1.0163 1.0296 1.0058 1.0012 1.0026 1.0114 1.0184 1.0036 1.0260 0.9940 1.0015
dispcorr: -0.028600895 hartree
energy: -1801.710020503573
dipole: -53.50139 52.01024 -1.49115 -6.62617 5.84542 -0.78075 -4.31571 4.12612 -0.18959
magnitude: 1.69383 au
magnitude: 4.30537 debye
