program: Orca
programVersion: 5.0.2
elementType: F F F F F F F O O N N N N C C C C C C C C C C C C C C C C C C C H H H H H H H H H H H H H H H
charge: 0
multiplicity: 1
keywords: wb97x-d3
keywords: def2-TZVPP
keywords: def2/J RIJCOSX
keywords: DEFGRID2
keywords: scfconv7
keywords: smallprint printgap noloewdin
keywords: NOSOSCF
formula: C19H15F7N4O2
InChI: InChI=1/C19H15F7N4O2/c1-11(31)30-15-5-4-14(17(20,18(21,22)23)19(24,25)26)7-13(15)10-29(16(30)32)28-9-12-3-2-6-27-8-12/h2-8,28H,9-10H2,1H3
47 atoms
F  3.187638 0.01152 2.091266
F  3.150474 -0.555487 -1.366839
F  2.628041 -1.856176 0.265415
F  4.642427 -1.134459 0.074525
F  3.389902 2.681573 1.242685
F  4.012934 1.96124 -0.690105
F  5.102716 1.400018 1.07172
O  -4.359628 -0.235744 -0.358414
O  -2.544052 3.457063 -0.183798
N  -2.86872 -0.767028 1.263171
N  -2.64629 1.232498 0.142201
N  -3.338501 -2.05784 1.442509
N  -3.295762 -2.555756 -2.989168
C  -0.772275 0.359491 1.329673
C  -1.827812 -0.295066 2.162267
C  -1.236069 1.127135 0.273072
C  1.4919 0.714156 0.606427
C  2.961472 0.407508 0.795152
C  0.584613 0.151218 1.497763
C  -0.343259 1.667233 -0.639886
C  1.015236 1.458042 -0.470278
C  -3.378422 0.030149 0.304863
C  3.363417 -0.802141 -0.078352
C  3.885674 1.633746 0.594235
C  -3.242476 2.474047 -0.075231
C  -2.586206 -3.05113 0.67098
C  -2.378648 -2.702827 -0.776082
C  -4.738806 2.560342 -0.128753
C  -1.217794 -2.079336 -1.213728
C  -3.380366 -2.918733 -1.718804
C  -1.118751 -1.683184 -2.539863
C  -2.185958 -1.938191 -3.383791
H  -1.430701 -1.151263 2.702315
H  -2.242028 0.39893 2.901324
H  0.910319 -0.465659 2.324207
H  -0.685493 2.222804 -1.499967
H  1.676037 1.883323 -1.211602
H  -4.325932 -2.082341 1.216156
H  -3.135683 -3.988122 0.773887
H  -1.618086 -3.198848 1.155061
H  -5.012061 3.612907 -0.093924
H  -5.225375 2.04686 0.700007
H  -5.122113 2.13609 -1.056019
H  -0.395312 -1.908029 -0.528723
H  -4.300748 -3.413053 -1.420637
H  -0.23223 -1.186919 -2.91151
H  -2.142017 -1.63927 -4.425264
elementType: F O N C H
totalener: -1801.67880450 hartree
nucrepener: 3632.34938059 hartree
electener: -5434.02818509 hartree
oneelecener: -9703.83392554 hartree
twoeener: 4269.80574045 hartree
cpcmener: -0.03933928 hartree
kineticenergy: 1794.99350520 hartree
xcener: -158.789040753663 hartree
chargesum: 0.0000000
charge: -0.198731 -0.158793 -0.159221 -0.155702 -0.154604 -0.157523 -0.153888 -0.471750 -0.456523 0.029502 -0.049532 -0.213342 -0.358388 -0.096058 -0.047021 0.157705 -0.006457 0.213751 -0.149641 -0.240215 -0.119340 0.257270 0.460736 0.486730 0.350052 -0.054197 0.021013 -0.249904 -0.122740 -0.027214 -0.171919 0.016806 0.118178 0.125169 0.135445 0.148316 0.151991 0.154477 0.119112 0.107356 0.102101 0.116831 0.114229 0.160951 0.129911 0.150520 0.144554
qa: -0.1987 -0.1588 -0.1592 -0.1557 -0.1546 -0.1575 -0.1539 -0.4718 -0.4565 0.0295 -0.0495 -0.2133 -0.3584 -0.0961 -0.0470 0.1577 -0.0065 0.2138 -0.1496 -0.2402 -0.1193 0.2573 0.4607 0.4867 0.3501 -0.0542 0.0210 -0.2499 -0.1227 -0.0272 -0.1719 0.0168 0.1182 0.1252 0.1354 0.1483 0.1520 0.1545 0.1191 0.1074 0.1021 0.1168 0.1142 0.1610 0.1299 0.1505 0.1446
va: 1.1003 1.1570 1.1564 1.1669 1.1620 1.1586 1.1691 2.0290 2.0396 3.1153 3.0902 2.9016 3.0678 3.8186 3.8920 3.6725 3.6349 4.0381 3.9818 4.0450 3.9939 4.4381 4.4767 4.4839 4.0554 3.9474 3.4927 3.8928 3.9045 4.0803 3.9018 4.0087 1.0103 0.9919 1.0272 1.0178 1.0159 1.0304 1.0038 0.9984 1.0186 1.0028 1.0120 0.9771 1.0116 0.9962 0.9996
dispcorr: -0.030708951 hartree
energy: -1801.709513450981
dipole: -55.59705 55.73171 0.13466 -8.60923 7.57075 -1.03848 -3.88053 5.49079 1.61026
magnitude: 1.92081 au
magnitude: 4.88231 debye
