program: Gaussian 09
title: 000053717
version: EM64L-G09RevD.01
frameworkgroup: C1[X(C13H14ClNO3)]
method: RPBEPBE
basis: SDD
operation: Freq
keyword: #p
keyword: freq=noraman
keyword: PBEPBE/SDD
title: #p freq=noraman PBEPBE/SDD
converged: YES YES NO NO
title: Mulliken charges:
elementType: Cl O O O N C C C C C C C C C C C C C H H H H H H H H H H H H H H
charge: -0.051795 -0.225487 -0.223440 -0.279286 -0.428516 0.356924 -0.493519 -0.188393 0.157546 -0.715546 -0.706569 0.179123 0.272748 -0.310083 -0.367423 -0.097210 -0.218409 -0.218296 0.273656 0.237234 0.296151 0.234352 0.235494 0.217977 0.220375 0.242301 0.232350 0.340404 0.299254 0.227786 0.238366 0.261932
chargesum: 0.00000
title: Mulliken charges with hydrogens summed into heavy atoms:
elementType: Cl O O O N C C C C C C C C C C C C C
charge: -0.051795 -0.225487 -0.223440 -0.279286 -0.088112 0.356924 0.017371 0.107757 0.157546 -0.027723 -0.011543 0.179123 0.272748 -0.010829 -0.139637 -0.097210 0.019957 0.043636
polarizability: 2.37082875e+02 2.83078838e+00 1.61836554e+02 -3.78577427e+00 7.89099973e+00 9.89494700e+01
1716.lowfreq: -7.5744 0.0005 0.0020 0.0023 4.3222 5.5583 20.6741 34.1920 51.2749
frequency: 20.3618 34.0393 51.2002 64.2076 104.8706 108.7753 147.3510 158.7016 179.2565 184.3509 214.7933 226.0966 263.6836 297.6370 321.4886 327.9567 351.5050 388.8424 404.2896 432.5727 441.2782 452.9285 512.7264 523.9919 558.9591 571.4073 593.2322 646.4469 661.7866 676.0033 701.0007 728.6364 765.4471 798.8125 817.6557 855.6319 890.6990 907.0566 928.0689 932.0885 941.3044 978.2565 978.8027 984.8627 990.6732 1027.3234 1072.6423 1082.9704 1091.8791 1104.5692 1120.1642 1170.7002 1182.7498 1190.8043 1219.3018 1252.5545 1259.6015 1275.6383 1296.6715 1303.9283 1343.5378 1381.9068 1384.2837 1399.4374 1411.4861 1452.3047 1454.0537 1462.5921 1472.4916 1474.8738 1483.2368 1488.4776 1561.1281 1593.2131 1604.0764 1684.6316 2968.9080 2991.0559 2994.1979 3028.6726 3087.0601 3091.2952 3098.9878 3103.7181 3115.9227 3137.4078 3156.8854 3171.4126 3178.1191 3503.3885
redmass: 6.8972 4.9956 5.1480 6.2421 3.8190 5.5451 5.4890 10.6528 4.9319 1.0509 5.8616 1.0928 6.9258 2.3569 3.1582 3.7727 4.0258 9.5804 3.4453 3.2303 3.0074 5.0186 5.6101 3.7265 3.3408 1.6694 3.1414 6.6828 4.4811 3.0889 7.0184 2.6882 6.7980 1.7146 3.6168 5.1927 3.0678 1.4001 1.6695 1.4560 1.6947 1.4789 1.3873 5.1165 2.1946 1.9195 2.2076 2.0371 1.6550 2.2938 2.7551 2.2075 1.2381 2.1440 1.6392 1.8904 2.3190 1.5868 1.8966 1.8683 1.4710 9.6614 1.2475 1.2062 2.7748 1.0533 2.1596 1.0486 1.0722 1.0839 1.0709 2.2773 7.2722 7.8948 6.6080 11.9062 1.0809 1.0358 1.0364 1.0642 1.0994 1.0993 1.1006 1.1002 1.1016 1.0873 1.0932 1.0926 1.0981 1.0774
irintensity: 1.3513 1.0140 6.7998 6.0953 0.1271 1.5244 7.4361 3.8061 1.2253 0.1905 3.7123 0.3118 5.5481 1.6368 3.7517 6.9558 1.0900 8.9128 2.8939 2.1988 2.8285 17.3396 2.8233 15.1599 9.9237 61.8771 31.7988 2.5103 8.6597 10.0350 48.7039 60.1168 9.0419 26.9947 11.3851 51.7071 1.2644 1.7483 0.8832 16.2218 5.1172 0.9324 0.2702 5.2909 28.4005 6.4196 19.1798 99.8216 13.0880 19.7919 150.9830 32.4032 2.2480 0.1885 6.6791 33.0853 151.5591 24.5472 11.6431 121.6151 2.7412 0.2217 32.8693 24.0516 7.2348 2.1109 162.7661 3.7451 15.2411 5.9599 27.5237 286.5834 143.4522 46.3952 4.3093 271.0336 20.2382 15.2815 13.0750 13.5100 16.8943 22.3160 8.9536 37.6417 10.5749 7.5151 9.5611 2.8132 7.6326 49.4054
temp: 298.150 k
press: 1.00000 atm
elementType: 17 8 8 8 7 6 6 6 6 6 6 6 6 6 6 6 6 6 1 1 1 1 1 1 1 1 1 1 1 1 1 1
symmnumber: 1
zpe: 646282.5 jmol-1
zpe.correction: 0.246156 hartree
zpe.thermalcorrener: 0.263464 hartree
zpe.thermalcorrenthalpy: 0.264408 hartree
zpe.thermalcorrgfe: 0.199360 hartree
zpe.sumelectzpe: -1242.975631 hartree
zpe.sumelectthermal: -1242.958323 hartree
zpe.sumelectthermalent: -1242.957379 hartree
zpe.sumelectthermalfe: -1243.022427 hartree
dipole: -1.7456 -0.0059 2.2846
dipole: 2.8752
quadrupole: -108.2789 -117.5523 -112.9235
quadrupole: 24.9241 -4.1646 6.5123
quadrupole: 4.6393 -4.6341 -0.0052 24.9241 -4.1646 6.5123
hfenergy: -1243.2217875 hartree
pointgroup: C01 [X(C13H14Cl1N1O3)]
dipole: 0.654819 -0.0867121 -0.9182916 debye
polarizability: 236.7762855|-1.5597512|159.0439843|-8.1882694|-14.9783484|102.0486289 unknown
InChI: InChI=1S/C13H14ClNO3/c1-13(2)7-10(12(17)18-13)15-11(16)8-4-3-5-9(14)6-8/h3-6,10,15H,7H2,1-2H3
charge 0 multiplicity 1
32 atoms
Cl -5.805595 -1.482988 0.610808
O  3.958505 0.842909 0.049809
O  2.356099 2.334789 0.839666
O  -0.417733 -1.76976 0.407022
N  0.400618 0.379441 0.143671
C  3.971891 -0.616313 -0.447543
C  2.461072 -0.932763 -0.646289
C  1.768601 -0.050881 0.417676
C  2.685261 1.185851 0.488149
C  4.781958 -0.60678 -1.745451
C  4.631011 -1.457678 0.657729
C  -0.638558 -0.535138 0.185762
C  -2.028651 0.001673 -0.041776
C  -3.105132 -0.846897 0.322388
C  -2.297113 1.27639 -0.605478
C  -4.420761 -0.396766 0.134191
C  -3.630745 1.702627 -0.787535
C  -4.709824 0.869613 -0.413274
H  2.231298 -2.000113 -0.512736
H  2.130237 -0.621187 -1.653256
H  1.800091 -0.575654 1.395426
H  4.353088 0.106616 -2.469547
H  5.830288 -0.321052 -1.553258
H  4.772432 -1.614399 -2.199516
H  4.753346 -2.500907 0.315229
H  5.627102 -1.051778 0.902604
H  4.026048 -1.470059 1.58139
H  0.231021 1.389577 0.179669
H  -2.880242 -1.834717 0.735096
H  -1.482858 1.93074 -0.935461
H  -3.83778 2.68354 -1.227424
H  -5.745574 1.193065 -0.549943
