program: Orca
programVersion: 5.0.2
elementType: F F F F F F F O O N N N N C C C C C C C C C C C C C C C C C C C H H H H H H H H H H H H H H H
charge: 0
multiplicity: 1
keywords: wb97x-d3
keywords: def2-TZVPP
keywords: def2/J RIJCOSX
keywords: DEFGRID2
keywords: scfconv7
keywords: smallprint printgap noloewdin
keywords: NOSOSCF
formula: C19H15F7N4O2
InChI: InChI=1/C19H15F7N4O2/c1-11(31)30-15-5-4-14(17(20,18(21,22)23)19(24,25)26)7-13(15)10-29(16(30)32)28-9-12-3-2-6-27-8-12/h2-8,28H,9-10H2,1H3
47 atoms
F  3.134464 0.169174 -2.040237
F  3.301151 2.786181 -1.123745
F  5.051138 1.550289 -0.983908
F  3.952764 2.046557 0.792766
F  2.649575 -1.787331 -0.283951
F  3.224905 -0.558288 1.386167
F  4.661329 -1.04923 -0.138341
O  -4.370392 -0.273145 0.403425
O  -2.541016 3.40493 0.743308
N  -2.918352 -0.549712 -1.314432
N  -2.660588 1.252984 0.093424
N  -3.408268 -1.790564 -1.690842
N  -3.114125 -3.021678 2.586621
C  -0.805731 0.546836 -1.223204
C  -1.87544 0.04092 -2.137448
C  -1.253144 1.155826 -0.061672
C  1.466336 0.773265 -0.478267
C  2.934895 0.499503 -0.721706
C  0.547403 0.350641 -1.432068
C  -0.348301 1.553551 0.910313
C  1.006363 1.361411 0.698226
C  -3.402476 0.089268 -0.23416
C  3.83014 1.740875 -0.496731
C  3.386672 -0.741191 0.080053
C  -3.246167 2.456026 0.482229
C  -2.626128 -2.902333 -1.142041
C  -2.331726 -2.805054 0.328521
C  -4.742469 2.546222 0.529172
C  -1.128414 -2.292426 0.794271
C  -3.284221 -3.15831 1.280559
C  -0.938714 -2.136074 2.159528
C  -1.963237 -2.509363 3.01246
H  -2.28366 0.846553 -2.756856
H  -1.493608 -0.72594 -2.807368
H  0.861767 -0.143399 -2.341083
H  -0.67884 1.982563 1.844399
H  1.678523 1.673859 1.483541
H  -4.381181 -1.851744 -1.416315
H  -1.688302 -2.968183 -1.69818
H  -3.191147 -3.8068 -1.371983
H  -5.22119 2.147255 -0.363776
H  -5.010698 3.595445 0.628427
H  -5.138545 2.008559 1.389478
H  -0.342654 -2.021666 0.098805
H  -4.236043 -3.573197 0.960896
H  -0.015597 -1.731923 2.553037
H  -1.850192 -2.398125 4.085278
elementType: F O N C H
totalener: -1801.67922131 hartree
nucrepener: 3635.02582727 hartree
electener: -5436.70504859 hartree
oneelecener: -9709.14569142 hartree
twoeener: 4272.44064283 hartree
cpcmener: -0.03971232 hartree
kineticenergy: 1795.00367246 hartree
xcener: -158.791062347263 hartree
chargesum: -0.0000000
charge: -0.198873 -0.155478 -0.154608 -0.157162 -0.158844 -0.159119 -0.155253 -0.474270 -0.457892 0.027312 -0.054935 -0.216047 -0.358799 -0.091320 -0.053588 0.170318 -0.005211 0.210738 -0.151423 -0.249651 -0.114005 0.268759 0.486113 0.462796 0.351864 -0.048554 0.015447 -0.251420 -0.129224 -0.023428 -0.175166 0.019182 0.126793 0.119479 0.133668 0.147205 0.150061 0.154986 0.106971 0.119470 0.116829 0.102394 0.115139 0.164087 0.130063 0.149763 0.144834
qa: -0.1989 -0.1555 -0.1546 -0.1572 -0.1588 -0.1591 -0.1553 -0.4743 -0.4579 0.0273 -0.0549 -0.2160 -0.3588 -0.0913 -0.0536 0.1703 -0.0052 0.2107 -0.1514 -0.2497 -0.1140 0.2688 0.4861 0.4628 0.3519 -0.0486 0.0154 -0.2514 -0.1292 -0.0234 -0.1752 0.0192 0.1268 0.1195 0.1337 0.1472 0.1501 0.1550 0.1070 0.1195 0.1168 0.1024 0.1151 0.1641 0.1301 0.1498 0.1448
va: 1.0999 1.1608 1.1686 1.1588 1.1554 1.1565 1.1679 2.0278 2.0392 3.1202 3.0901 2.9009 3.0683 3.7987 3.8994 3.6607 3.6047 4.0380 3.9642 4.0619 4.0000 4.4238 4.4817 4.4751 4.0532 3.9364 3.4999 3.8943 3.9039 4.0749 3.9011 4.0078 0.9916 1.0084 1.0270 1.0186 1.0166 1.0314 0.9982 1.0042 1.0027 1.0184 1.0116 0.9748 1.0119 0.9972 0.9995
dispcorr: -0.030801938 hartree
energy: -1801.710023252783
dipole: -55.23185 55.35177 0.11992 -9.50863 8.70952 -0.79911 2.55295 -4.37594 -1.82299
magnitude: 1.99405 au
magnitude: 5.06847 debye
