program: Orca
programVersion: 5.0.2
elementType: F F F F F F F O O N N N N C C C C C C C C C C C C C C C C C C C H H H H H H H H H H H H H H H
charge: 0
multiplicity: 1
keywords: wb97x-d3
keywords: def2-TZVPP
keywords: def2/J RIJCOSX
keywords: DEFGRID2
keywords: scfconv7
keywords: smallprint printgap noloewdin
keywords: NOSOSCF
formula: C19H15F7N4O2
InChI: InChI=1/C19H15F7N4O2/c1-11(31)30-15-5-4-14(17(20,18(21,22)23)19(24,25)26)7-13(15)10-29(16(30)32)28-9-12-3-2-6-27-8-12/h2-8,28H,9-10H2,1H3
47 atoms
F  3.640068 1.332254 1.212595
F  2.901089 -1.211587 1.380926
F  4.64287 -1.011306 0.138233
F  2.726436 -1.424403 -0.752824
F  3.245734 2.682335 -1.236529
F  3.464479 0.780104 -2.227035
F  5.020374 1.512704 -0.939154
O  -4.301769 -0.335959 0.167418
O  -2.678241 3.129281 1.67749
N  -2.69329 -0.11625 -1.412942
N  -2.637776 1.245629 0.444893
N  -3.095769 -1.213464 -2.158492
N  -3.418871 -3.651016 1.553114
C  -0.642291 0.935684 -0.815535
C  -1.596061 0.679251 -1.936853
C  -1.219204 1.217311 0.413576
C  1.538971 0.980455 0.184654
C  3.033524 0.763759 0.120554
C  0.728384 0.806743 -0.93215
C  -0.422428 1.370043 1.537931
C  0.952878 1.255974 1.41618
C  -3.296691 0.199546 -0.252569
C  3.341103 -0.749102 0.214539
C  3.704231 1.443011 -1.096283
C  -3.311658 2.280745 1.090672
C  -2.337925 -2.424555 -1.831478
C  -2.291161 -2.756154 -0.367064
C  -4.808533 2.329119 1.005294
C  -1.238049 -2.34663 0.440166
C  -3.352031 -3.41068 0.252706
C  -1.300363 -2.579953 1.80648
C  -2.412952 -3.229502 2.313664
H  -1.968012 1.615385 -2.366887
H  -1.119995 0.118008 -2.737694
H  1.127864 0.558499 -1.905288
H  -0.851588 1.543816 2.513252
H  1.551475 1.369195 2.308629
H  -4.090749 -1.352132 -2.023498
H  -1.322448 -2.304579 -2.216269
H  -2.798345 -3.231239 -2.403716
H  -5.261088 1.571136 1.643856
H  -5.181357 2.179298 -0.00706
H  -5.1318 3.307562 1.354018
H  -0.373719 -1.854982 0.008323
H  -4.189055 -3.76152 -0.34448
H  -0.502277 -2.264741 2.465169
H  -2.496472 -3.422336 3.377428
elementType: F O N C H
totalener: -1801.67917985 hartree
nucrepener: 3637.57228724 hartree
electener: -5439.25146709 hartree
oneelecener: -9714.08679134 hartree
twoeener: 4274.83532425 hartree
cpcmener: -0.03980694 hartree
kineticenergy: 1795.00821886 hartree
xcener: -158.791791545756 hartree
chargesum: -0.0000000
charge: -0.196160 -0.159375 -0.155795 -0.159836 -0.154680 -0.158631 -0.153015 -0.470190 -0.457785 0.030426 -0.048461 -0.206780 -0.358076 -0.093341 -0.049369 0.152940 -0.009497 0.210267 -0.137179 -0.237876 -0.129277 0.249956 0.465938 0.485552 0.350694 -0.057770 0.011630 -0.251079 -0.117734 -0.026333 -0.169008 0.014818 0.125640 0.117825 0.141232 0.147370 0.146598 0.153757 0.109034 0.119616 0.115625 0.116965 0.101966 0.164481 0.129649 0.150567 0.144702
qa: -0.1962 -0.1594 -0.1558 -0.1598 -0.1547 -0.1586 -0.1530 -0.4702 -0.4578 0.0304 -0.0485 -0.2068 -0.3581 -0.0933 -0.0494 0.1529 -0.0095 0.2103 -0.1372 -0.2379 -0.1293 0.2500 0.4659 0.4856 0.3507 -0.0578 0.0116 -0.2511 -0.1177 -0.0263 -0.1690 0.0148 0.1256 0.1178 0.1412 0.1474 0.1466 0.1538 0.1090 0.1196 0.1156 0.1170 0.1020 0.1645 0.1296 0.1506 0.1447
va: 1.1041 1.1581 1.1667 1.1534 1.1625 1.1561 1.1706 2.0301 2.0379 3.1234 3.0844 2.9010 3.0666 3.8510 3.8998 3.6702 3.6425 4.0590 3.9811 4.0346 4.0122 4.4406 4.4609 4.4739 4.0534 3.9552 3.4929 3.8945 3.8977 4.0831 3.9064 4.0092 0.9920 1.0103 1.0277 1.0193 1.0151 1.0315 0.9987 1.0050 1.0115 1.0026 1.0182 0.9719 1.0108 0.9961 0.9994
dispcorr: -0.030594930 hartree
energy: -1801.709774777107
dipole: -54.47360 54.79374 0.32014 -7.97442 7.75515 -0.21928 1.88652 -3.91210 -2.02558
magnitude: 2.06241 au
magnitude: 5.24224 debye
