program: Orca
programVersion: 5.0.2
elementType: F F F F F F F O O N N N N C C C C C C C C C C C C C C C C C C C H H H H H H H H H H H H H H H
charge: 0
multiplicity: 1
keywords: wb97x-d3
keywords: def2-TZVPP
keywords: def2/J RIJCOSX
keywords: DEFGRID2
keywords: scfconv7
keywords: smallprint printgap noloewdin
keywords: NOSOSCF
formula: C19H15F7N4O2
InChI: InChI=1/C19H15F7N4O2/c1-11(31)30-15-5-4-14(17(20,18(21,22)23)19(24,25)26)7-13(15)10-29(16(30)32)28-9-12-3-2-6-27-8-12/h2-8,28H,9-10H2,1H3
47 atoms
F  3.620982 1.008909 -1.386322
F  3.411421 1.480091 2.068304
F  3.186219 2.987676 0.548644
F  4.981249 1.812542 0.638889
F  2.881425 -1.499124 -0.817083
F  2.858618 -1.109557 1.299766
F  4.69036 -0.92087 0.187411
O  -4.345612 -0.346132 -0.231933
O  -2.637989 2.830148 -2.200791
N  -2.765247 0.084413 1.333462
N  -2.647824 1.147786 -0.704757
N  -3.234716 -0.858617 2.234703
N  -3.094901 -3.794562 -1.129917
C  -0.684285 1.014662 0.636688
C  -1.668383 0.937921 1.760171
C  -1.230826 1.107916 -0.635303
C  1.52112 0.913104 -0.306543
C  3.020323 0.752315 -0.178046
C  0.684381 0.910923 0.805638
C  -0.4086 1.081257 -1.750479
C  0.963038 0.988629 -1.578918
C  -3.339243 0.231871 0.127467
C  3.66221 1.77113 0.794092
C  3.377082 -0.718577 0.139572
C  -3.2927 2.098803 -1.491983
C  -2.482309 -2.115695 2.182988
C  -2.237794 -2.656022 0.801489
C  -4.786622 2.2175 -1.397985
C  -1.038045 -2.433148 0.138744
C  -3.228716 -3.347702 0.109674
C  -0.885571 -2.889545 -1.16249
C  -1.943836 -3.55985 -1.752574
H  -1.218651 0.498749 2.648258
H  -2.037333 1.932508 2.034447
H  1.061548 0.820737 1.815025
H  -0.812455 1.102592 -2.751475
H  1.580739 0.962326 -2.464604
H  -4.220344 -1.011474 2.055254
H  -3.04604 -2.826288 2.789443
H  -1.525115 -1.963104 2.687371
H  -5.074725 3.158893 -1.861484
H  -5.152549 2.208353 -0.371756
H  -5.277518 1.407651 -1.937062
H  -0.225523 -1.915539 0.635805
H  -4.180643 -3.5494 0.59305
H  0.034756 -2.729592 -1.708224
H  -1.858066 -3.928451 -2.768959
elementType: F O N C H
totalener: -1801.67951262 hartree
nucrepener: 3639.32353958 hartree
electener: -5441.00305220 hartree
oneelecener: -9717.60515982 hartree
twoeener: 4276.60210762 hartree
cpcmener: -0.04005560 hartree
kineticenergy: 1794.98038290 hartree
xcener: -158.786316238652 hartree
chargesum: -0.0000000
charge: -0.195888 -0.157790 -0.155863 -0.154570 -0.158539 -0.160471 -0.155599 -0.477186 -0.458489 0.023974 -0.061343 -0.216133 -0.358452 -0.094090 -0.057432 0.168638 -0.002053 0.199210 -0.143656 -0.239070 -0.120524 0.281078 0.484816 0.469825 0.352083 -0.047859 0.022991 -0.250632 -0.145722 -0.021753 -0.168286 0.018140 0.119322 0.126339 0.138031 0.147873 0.145209 0.155605 0.120775 0.106171 0.103016 0.116284 0.116091 0.160248 0.129844 0.151074 0.144763
qa: -0.1959 -0.1578 -0.1559 -0.1546 -0.1585 -0.1605 -0.1556 -0.4772 -0.4585 0.0240 -0.0613 -0.2161 -0.3585 -0.0941 -0.0574 0.1686 -0.0021 0.1992 -0.1437 -0.2391 -0.1205 0.2811 0.4848 0.4698 0.3521 -0.0479 0.0230 -0.2506 -0.1457 -0.0218 -0.1683 0.0181 0.1193 0.1263 0.1380 0.1479 0.1452 0.1556 0.1208 0.1062 0.1030 0.1163 0.1161 0.1602 0.1298 0.1511 0.1448
va: 1.1030 1.1574 1.1609 1.1685 1.1557 1.1536 1.1679 2.0267 2.0387 3.1285 3.0938 2.8974 3.0684 3.8415 3.9061 3.6636 3.5943 4.0509 3.9766 4.0377 4.0035 4.4088 4.4733 4.4590 4.0521 3.9287 3.4972 3.8945 3.9211 4.0704 3.8953 4.0094 1.0074 0.9918 1.0272 1.0191 1.0144 1.0317 1.0033 0.9979 1.0178 1.0027 1.0112 0.9768 1.0125 0.9972 0.9995
dispcorr: -0.030726492 hartree
energy: -1801.710239114686
dipole: -54.06233 54.30899 0.24666 -9.15084 9.17865 0.02781 -1.10171 3.34374 2.24203
magnitude: 2.25573 au
magnitude: 5.73360 debye
