program: Orca
programVersion: 5.0.2
elementType: F F F F F F F O O N N N N C C C C C C C C C C C C C C C C C C C H H H H H H H H H H H H H H H
charge: 0
multiplicity: 1
keywords: wb97x-d3
keywords: def2-TZVPP
keywords: def2/J RIJCOSX
keywords: DEFGRID2
keywords: scfconv7
keywords: smallprint printgap noloewdin
keywords: NOSOSCF
formula: C19H15F7N4O2
InChI: InChI=1/C19H15F7N4O2/c1-11(31)30-15-5-4-14(17(20,18(21,22)23)19(24,25)26)7-13(15)10-29(16(30)32)28-9-12-3-2-6-27-8-12/h2-8,28H,9-10H2,1H3
47 atoms
F  2.703967 -1.176424 -0.92678
F  2.880685 1.029696 -2.367292
F  4.716746 0.735973 -1.293441
F  3.335663 2.261355 -0.661596
F  4.521573 -0.983413 0.852255
F  2.656029 -0.940343 1.906117
F  3.805125 0.869783 1.671823
O  -4.750305 0.524649 0.618988
O  -2.300911 3.838274 0.473565
N  -3.295978 -0.30236 -0.907036
N  -2.773527 1.651071 0.207147
N  -3.987213 -1.483149 -1.110192
N  -0.35703 -3.717698 -0.524197
C  -1.022797 0.427467 -0.858249
C  -2.129568 -0.052813 -1.739077
C  -1.397381 1.30432 0.147526
C  1.244755 0.468866 -0.066817
C  2.677553 0.020789 -0.253983
C  0.289149 0.003629 -0.963878
C  -0.459124 1.749421 1.066861
C  0.85892 1.34336 0.945395
C  -3.704449 0.597417 0.00873
C  3.426033 1.030547 -1.155415
C  3.431068 -0.258076 1.068781
C  -3.152923 2.986699 0.354717
C  -3.852276 -2.433267 -0.007631
C  -2.403893 -2.731314 0.247575
C  -4.612427 3.330498 0.321871
C  -1.748922 -2.252969 1.373667
C  -1.649129 -3.459717 -0.667398
C  -0.398276 -2.519484 1.539156
C  0.25372 -3.250138 0.560031
H  -2.359736 0.686434 -2.514225
H  -1.868657 -0.98148 -2.238399
H  0.542709 -0.694155 -1.750275
H  -0.736118 2.394984 1.886838
H  1.5617 1.725655 1.671364
H  -4.962358 -1.284102 -1.301797
H  -4.381735 -3.335215 -0.320881
H  -4.323835 -2.091331 0.91895
H  -5.126887 2.899604 -0.536389
H  -4.69816 4.413653 0.271036
H  -5.118826 2.986039 1.222586
H  -2.289734 -1.677328 2.115769
H  -2.12206 -3.853706 -1.562444
H  0.138168 -2.163702 2.407754
H  1.30965 -3.476834 0.655322
elementType: F O N C H
totalener: -1801.68022337 hartree
nucrepener: 3672.52492450 hartree
electener: -5474.20514787 hartree
oneelecener: -9784.87368776 hartree
twoeener: 4310.66853989 hartree
cpcmener: -0.03497328 hartree
kineticenergy: 1795.00673148 hartree
xcener: -158.792198199301 hartree
chargesum: 0.0000000
charge: -0.200127 -0.157133 -0.157291 -0.155261 -0.154494 -0.154389 -0.158379 -0.471344 -0.453995 0.007514 -0.074369 -0.222850 -0.351742 -0.070198 -0.071226 0.126809 -0.049399 0.211858 -0.134959 -0.197803 -0.113658 0.315562 0.474857 0.482564 0.351963 -0.042177 0.038998 -0.250327 -0.155830 -0.046300 -0.124219 -0.006478 0.128714 0.120842 0.134120 0.151106 0.146080 0.148243 0.117651 0.116802 0.118094 0.101141 0.114665 0.145872 0.129724 0.152677 0.138094
qa: -0.2001 -0.1571 -0.1573 -0.1553 -0.1545 -0.1544 -0.1584 -0.4713 -0.4540 0.0075 -0.0744 -0.2229 -0.3517 -0.0702 -0.0712 0.1268 -0.0494 0.2119 -0.1350 -0.1978 -0.1137 0.3156 0.4749 0.4826 0.3520 -0.0422 0.0390 -0.2503 -0.1558 -0.0463 -0.1242 -0.0065 0.1287 0.1208 0.1341 0.1511 0.1461 0.1482 0.1177 0.1168 0.1181 0.1011 0.1147 0.1459 0.1297 0.1527 0.1381
va: 1.0963 1.1646 1.1626 1.1627 1.1688 1.1538 1.1589 2.0433 2.0410 3.1195 3.0982 2.8931 3.0534 3.8331 3.9067 3.7473 3.6671 4.0010 3.8994 4.0594 3.9941 4.3914 4.4927 4.4717 4.0563 3.8502 3.5553 3.8905 3.9336 4.0715 3.8341 3.9927 0.9933 1.0131 1.0327 1.0152 1.0190 1.0248 1.0061 1.0052 1.0017 1.0188 1.0122 1.0035 1.0197 0.9974 1.0126
dispcorr: -0.032019408 hartree
energy: -1801.712242779332
dipole: -55.31220 53.55710 -1.75509 -5.81591 5.39092 -0.42499 1.74124 -1.81484 -0.07361
magnitude: 1.80731 au
magnitude: 4.59382 debye
