program: Orca
programVersion: 5.0.2
elementType: F F F F F F F O O N N N N C C C C C C C C C C C C C C C C C C C H H H H H H H H H H H H H H H
charge: 0
multiplicity: 1
keywords: wb97x-d3
keywords: def2-TZVPP
keywords: def2/J RIJCOSX
keywords: DEFGRID2
keywords: scfconv7
keywords: smallprint printgap noloewdin
keywords: NOSOSCF
formula: C19H15F7N4O2
InChI: InChI=1/C19H15F7N4O2/c1-11(31)30-15-5-4-14(17(20,18(21,22)23)19(24,25)26)7-13(15)10-29(16(30)32)28-9-12-3-2-6-27-8-12/h2-8,28H,9-10H2,1H3
47 atoms
F  4.057445 -0.445313 -0.915145
F  4.030002 3.039622 -0.599151
F  3.516895 1.832024 -2.30821
F  5.482981 1.70771 -1.455729
F  3.993659 -0.463994 1.754998
F  4.147742 1.682638 1.865716
F  5.727825 0.528424 0.974546
O  -3.358056 -0.719928 1.684501
O  -2.33388 2.706956 -0.372746
N  -1.837723 -1.681894 0.306778
N  -1.985578 0.617576 0.391121
N  -2.061856 -2.974843 0.764701
N  -5.739059 -1.611863 -1.562515
C  0.061921 -0.365404 -0.332077
C  -0.815734 -1.514165 -0.712776
C  -0.580584 0.724237 0.233244
C  2.183255 0.735581 -0.081755
C  3.687388 0.70227 -0.256348
C  1.437591 -0.366607 -0.483071
C  0.157328 1.815615 0.667943
C  1.531392 1.820628 0.501579
C  -2.482857 -0.635458 0.847134
C  4.193645 1.84673 -1.163982
C  4.408554 0.621092 1.108554
C  -2.818845 1.678313 0.04341
C  -3.012224 -3.719498 -0.063337
C  -4.350659 -3.065753 -0.249868
C  -4.302944 1.496172 0.159736
C  -5.363735 -3.18115 0.695657
C  -4.602749 -2.268428 -1.35987
C  -6.555314 -2.507861 0.494893
C  -6.691849 -1.731199 -0.647028
H  -1.274367 -1.342562 -1.692153
H  -0.251644 -2.442645 -0.768121
H  1.905593 -1.23892 -0.917277
H  -0.312856 2.65596 1.155666
H  2.065323 2.690357 0.853205
H  -2.382961 -2.924213 1.724602
H  -3.122331 -4.693992 0.414746
H  -2.545708 -3.899611 -1.034401
H  -4.654824 0.578784 -0.310672
H  -4.782669 2.34124 -0.329152
H  -4.615943 1.47901 1.202991
H  -5.221147 -3.793351 1.578753
H  -3.843814 -2.16198 -2.130171
H  -7.366858 -2.578027 1.20667
H  -7.61139 -1.185833 -0.828915
elementType: F O N C H
totalener: -1801.68058812 hartree
nucrepener: 3478.82795346 hartree
electener: -5280.50854158 hartree
oneelecener: -9397.65336365 hartree
twoeener: 4117.14482207 hartree
cpcmener: -0.03803019 hartree
kineticenergy: 1794.99122782 hartree
xcener: -158.787229386488 hartree
chargesum: -0.0000000
charge: -0.197943 -0.156556 -0.157044 -0.155603 -0.157543 -0.156659 -0.156040 -0.470013 -0.458547 0.000928 -0.063721 -0.203147 -0.371195 -0.075276 -0.046818 0.147315 -0.051327 0.185522 -0.079407 -0.237638 -0.100720 0.285409 0.478442 0.470863 0.347895 -0.031761 0.021813 -0.242091 -0.171665 -0.015718 -0.118866 0.000300 0.121961 0.109652 0.135114 0.149621 0.146472 0.148868 0.117449 0.112091 0.101594 0.102654 0.115738 0.148311 0.127929 0.156252 0.143105
qa: -0.1979 -0.1566 -0.1570 -0.1556 -0.1575 -0.1567 -0.1560 -0.4700 -0.4585 0.0009 -0.0637 -0.2031 -0.3712 -0.0753 -0.0468 0.1473 -0.0513 0.1855 -0.0794 -0.2376 -0.1007 0.2854 0.4784 0.4709 0.3479 -0.0318 0.0218 -0.2421 -0.1717 -0.0157 -0.1189 0.0003 0.1220 0.1097 0.1351 0.1496 0.1465 0.1489 0.1174 0.1121 0.1016 0.1027 0.1157 0.1483 0.1279 0.1563 0.1431
va: 1.0991 1.1589 1.1599 1.1672 1.1605 1.1589 1.1661 2.0289 2.0375 3.1680 3.1056 2.8993 3.0302 3.9044 3.8919 3.7466 3.6392 4.0569 3.9682 4.0817 4.0350 4.3722 4.4780 4.4810 4.0724 3.9090 3.4545 3.8813 3.9667 3.9953 3.8697 3.9825 0.9890 1.0154 1.0244 1.0184 1.0178 1.0349 1.0046 0.9995 1.0111 1.0224 1.0140 1.0014 1.0135 0.9901 0.9999
dispcorr: -0.028037256 hartree
energy: -1801.708625378188
dipole: -70.16763 69.41685 -0.75078 -22.64473 20.15780 -2.48693 0.77694 -0.28117 0.49576
magnitude: 2.64467 au
magnitude: 6.72221 debye
