program: Orca
programVersion: 5.0.2
elementType: F F F F F F F O O N N N N C C C C C C C C C C C C C C C C C C C H H H H H H H H H H H H H H H
charge: 0
multiplicity: 1
keywords: wb97x-d3
keywords: def2-TZVPP
keywords: def2/J RIJCOSX
keywords: DEFGRID2
keywords: scfconv7
keywords: smallprint printgap noloewdin
keywords: NOSOSCF
formula: C19H15F7N4O2
InChI: InChI=1/C19H15F7N4O2/c1-11(31)30-15-5-4-14(17(20,18(21,22)23)19(24,25)26)7-13(15)10-29(16(30)32)28-9-12-3-2-6-27-8-12/h2-8,28H,9-10H2,1H3
47 atoms
F  3.287838 -0.007295 1.955829
F  3.196528 -0.558636 -1.502441
F  2.706571 -1.872523 0.12907
F  4.711271 -1.12885 -0.081007
F  3.422976 2.674686 1.101797
F  4.033359 1.957392 -0.835868
F  5.153906 1.419682 0.914771
O  -4.377166 -0.175314 -0.164507
O  -2.477978 3.467723 -0.097544
N  -2.812603 -0.752531 1.369531
N  -2.601697 1.245153 0.241465
N  -3.30905 -2.030968 1.579604
N  -1.385064 -1.714188 -2.529606
C  -0.687386 0.326741 1.324286
C  -1.706868 -0.318409 2.207075
C  -1.189215 1.109042 0.295801
C  1.548498 0.681502 0.518564
C  3.025989 0.390986 0.667155
C  0.673628 0.111945 1.437545
C  -0.330641 1.644883 -0.651749
C  1.032985 1.429651 -0.536473
C  -3.352908 0.060049 0.442744
C  3.426659 -0.809637 -0.218213
C  3.927362 1.632029 0.450835
C  -3.184462 2.499327 0.072204
C  -2.624702 -3.038445 0.763187
C  -2.574857 -2.727562 -0.705695
C  -4.678918 2.619728 0.14478
C  -3.664343 -2.952693 -1.540504
C  -1.460184 -2.113282 -1.264558
C  -3.596382 -2.551981 -2.862542
C  -2.439153 -1.926281 -3.305382
H  -1.296175 -1.19229 2.707436
H  -2.057322 0.370437 2.98305
H  1.028501 -0.510471 2.247685
H  -0.703132 2.208596 -1.493901
H  1.666678 1.85578 -1.300632
H  -4.305992 -2.026493 1.4001
H  -3.144794 -3.979677 0.947616
H  -1.611059 -3.157093 1.153002
H  -5.148283 2.228215 -0.75675
H  -4.922571 3.676878 0.22458
H  -5.108141 2.098336 0.999225
H  -4.558347 -3.431172 -1.157438
H  -0.578099 -1.94024 -0.654176
H  -4.423957 -2.708429 -3.541286
H  -2.362664 -1.5868 -4.33266
elementType: F O N C H
totalener: -1801.67957548 hartree
nucrepener: 3616.78713988 hartree
electener: -5418.46671536 hartree
oneelecener: -9674.20314540 hartree
twoeener: 4255.73643004 hartree
cpcmener: -0.03876663 hartree
kineticenergy: 1794.99422870 hartree
xcener: -158.788369932944 hartree
chargesum: 0.0000000
charge: -0.198976 -0.157333 -0.159133 -0.156669 -0.155043 -0.157200 -0.154255 -0.472418 -0.457181 0.025734 -0.049725 -0.205041 -0.372468 -0.097372 -0.043165 0.148096 -0.015752 0.206069 -0.138153 -0.230459 -0.112258 0.255544 0.462847 0.485549 0.350173 -0.055294 0.027738 -0.250503 -0.173429 0.005645 -0.132065 0.001886 0.117354 0.124508 0.135710 0.148260 0.151376 0.152284 0.117715 0.110935 0.114556 0.102340 0.116479 0.149094 0.136138 0.155080 0.142781
qa: -0.1990 -0.1573 -0.1591 -0.1567 -0.1550 -0.1572 -0.1543 -0.4724 -0.4572 0.0257 -0.0497 -0.2050 -0.3725 -0.0974 -0.0432 0.1481 -0.0158 0.2061 -0.1382 -0.2305 -0.1123 0.2555 0.4628 0.4855 0.3502 -0.0553 0.0277 -0.2505 -0.1734 0.0056 -0.1321 0.0019 0.1174 0.1245 0.1357 0.1483 0.1514 0.1523 0.1177 0.1109 0.1146 0.1023 0.1165 0.1491 0.1361 0.1551 0.1428
va: 1.0992 1.1602 1.1574 1.1655 1.1611 1.1591 1.1685 2.0301 2.0396 3.1326 3.0926 2.8972 3.0412 3.8297 3.8900 3.6701 3.6504 4.0426 3.9887 4.0595 4.0100 4.4370 4.4761 4.4856 4.0533 3.9509 3.4884 3.8937 3.9654 3.9915 3.8893 4.0219 1.0103 0.9922 1.0267 1.0178 1.0156 1.0323 1.0045 0.9999 1.0118 1.0184 1.0029 1.0004 1.0020 0.9908 0.9990
dispcorr: -0.029912186 hartree
energy: -1801.709487667082
dipole: -59.92942 58.18183 -1.74758 -9.84747 8.01543 -1.83204 -2.15146 3.42256 1.27110
magnitude: 2.83304 au
magnitude: 7.20101 debye
