program: Orca
programVersion: 5.0.2
elementType: F F F F F F F O O N N N N C C C C C C C C C C C C C C C C C C C H H H H H H H H H H H H H H H
charge: 0
multiplicity: 1
keywords: wb97x-d3
keywords: def2-TZVPP
keywords: def2/J RIJCOSX
keywords: DEFGRID2
keywords: scfconv7
keywords: smallprint printgap noloewdin
keywords: NOSOSCF
formula: C19H15F7N4O2
InChI: InChI=1/C19H15F7N4O2/c1-11(31)30-15-5-4-14(17(20,18(21,22)23)19(24,25)26)7-13(15)10-29(16(30)32)28-9-12-3-2-6-27-8-12/h2-8,28H,9-10H2,1H3
47 atoms
F  3.768874 2.329146 -0.985813
F  3.408751 2.660709 1.615543
F  5.173391 1.491088 1.240923
F  3.395635 0.546662 2.008286
F  3.3392 -0.254926 -2.076904
F  3.915356 -1.063091 -0.165326
F  5.248304 0.240183 -1.233701
O  -3.999044 0.835519 1.357704
O  -2.635084 2.546883 -2.054052
N  -2.272025 -0.616448 1.181768
N  -2.385031 1.203742 -0.249585
N  -2.683582 -1.407163 2.239004
N  -2.671848 -4.742458 -0.419398
C  -0.2866 0.109388 0.054602
C  -1.127399 -1.072309 0.414804
C  -0.968223 1.270334 -0.285342
C  1.819212 1.21898 -0.272151
C  3.330346 1.251245 -0.259343
C  1.09495 0.084978 0.075366
C  -0.253323 2.419383 -0.592284
C  1.130441 2.382288 -0.590851
C  -2.977899 0.480867 0.818006
C  3.845689 1.484385 1.179003
C  3.974458 0.019766 -0.944101
C  -3.15867 1.837271 -1.236461
C  -3.918742 -2.151542 1.995064
C  -3.78279 -2.962044 0.741313
C  -4.636916 1.549563 -1.276185
C  -4.473568 -2.635915 -0.415546
C  -2.89506 -4.033063 0.673353
C  -4.250575 -3.371082 -1.569401
C  -3.33643 -4.411176 -1.51867
H  -1.448735 -1.610172 -0.485152
H  -0.58142 -1.77648 1.037996
H  1.582314 -0.836932 0.36033
H  -0.751845 3.344291 -0.829276
H  1.662783 3.287517 -0.841167
H  -2.762796 -0.839053 3.07325
H  -4.803765 -1.512267 1.932836
H  -4.050552 -2.80611 2.860046
H  -4.868472 0.492498 -1.156861
H  -5.004204 1.885591 -2.242264
H  -5.163733 2.087737 -0.491193
H  -5.178912 -1.812799 -0.412049
H  -2.332132 -4.321022 1.556411
H  -4.76969 -3.14198 -2.489797
H  -3.131667 -5.005799 -2.401755
totalener: -1801.65379435 hartree
nucrepener: 3509.16026959 hartree
electener: -5310.81406394 hartree
oneelecener: -9457.96768947 hartree
twoeener: 4147.15362553 hartree
kineticenergy: 1795.07682852 hartree
xcener: -158.797237431875 hartree
chargesum: 0.0000000
charge: -0.188039 -0.151455 -0.148811 -0.155320 -0.148741 -0.160837 -0.143098 -0.385038 -0.356497 -0.007730 -0.081926 -0.182207 -0.282929 -0.034599 -0.084536 0.079196 -0.060494 0.175516 -0.094483 -0.133892 -0.111607 0.251004 0.457727 0.476896 0.299905 -0.079347 0.006260 -0.251060 -0.169156 -0.015034 -0.100679 0.005185 0.112918 0.100742 0.124559 0.133470 0.129266 0.124921 0.123491 0.109130 0.080386 0.113213 0.120112 0.136874 0.115945 0.128598 0.122200
qa: -0.1880 -0.1515 -0.1488 -0.1553 -0.1487 -0.1608 -0.1431 -0.3850 -0.3565 -0.0077 -0.0819 -0.1822 -0.2829 -0.0346 -0.0845 0.0792 -0.0605 0.1755 -0.0945 -0.1339 -0.1116 0.2510 0.4577 0.4769 0.2999 -0.0793 0.0063 -0.2511 -0.1692 -0.0150 -0.1007 0.0052 0.1129 0.1007 0.1246 0.1335 0.1293 0.1249 0.1235 0.1091 0.0804 0.1132 0.1201 0.1369 0.1159 0.1286 0.1222
va: 1.1118 1.1707 1.1755 1.1616 1.1694 1.1526 1.1842 2.1170 2.1249 3.1044 3.1120 2.9236 3.0981 3.8895 3.8851 3.9111 3.8139 4.0755 4.0120 4.0441 4.0645 4.3996 4.4823 4.4794 4.0981 3.8808 3.5899 3.8930 3.9675 4.0642 3.9007 4.0274 0.9794 1.0223 1.0351 1.0292 1.0217 1.0393 1.0069 1.0065 1.0079 1.0171 1.0128 1.0009 1.0173 1.0008 1.0016
dispcorr: -0.027711425 hartree
energy: -1801.681505776465
dipole: -65.32002 64.03272 -1.28730 -17.25110 16.66064 -0.59046 -0.83799 1.29396 0.45597
magnitude: 1.48785 au
magnitude: 3.78181 debye
