program: Orca
programVersion: 5.0.2
elementType: F F F F F F F O O N N N N C C C C C C C C C C C C C C C C C C C H H H H H H H H H H H H H H H
charge: 0
multiplicity: 1
keywords: wb97x-d3
keywords: def2-TZVPP
keywords: def2/J RIJCOSX
keywords: DEFGRID2
keywords: scfconv7
keywords: smallprint printgap noloewdin
keywords: NOSOSCF
formula: C19H15F7N4O2
InChI: InChI=1/C19H15F7N4O2/c1-11(31)30-15-5-4-14(17(20,18(21,22)23)19(24,25)26)7-13(15)10-29(16(30)32)28-9-12-3-2-6-27-8-12/h2-8,28H,9-10H2,1H3
47 atoms
F  3.788962 2.529933 0.274918
F  3.852929 -0.950966 0.009988
F  3.466613 0.171373 1.808268
F  5.285404 0.486776 0.714803
F  4.981913 1.300866 -1.910142
F  3.207694 2.449368 -2.297849
F  3.126087 0.299778 -2.345771
O  -4.141903 0.692272 -1.153986
O  -2.59012 3.061566 1.696684
N  -2.398844 -0.713861 -0.843847
N  -2.417908 1.340162 0.234244
N  -2.884995 -1.667683 -1.721951
N  -3.684793 -3.493425 2.396776
C  -0.337808 0.206304 -0.042506
C  -1.183684 -1.022936 -0.117469
C  -1.003697 1.410869 0.149113
C  1.779746 1.343445 -0.074759
C  3.284492 1.356669 -0.224638
C  1.036995 0.172588 -0.170043
C  -0.273089 2.590356 0.206846
C  1.107995 2.545617 0.10461
C  -3.082578 0.43558 -0.633003
C  3.989016 0.244427 0.589932
C  3.666563 1.343967 -1.722759
C  -3.139268 2.161581 1.118469
C  -4.017587 -2.423108 -1.190862
C  -3.587437 -3.201756 0.016883
C  -4.58814 1.830927 1.367886
C  -2.638833 -4.214813 -0.070746
C  -4.070021 -2.890161 1.281049
C  -2.231937 -4.857714 1.083705
C  -2.7837 -4.456425 2.294375
H  -0.680031 -1.821921 -0.656808
H  -1.412912 -1.398966 0.886764
H  1.506012 -0.78683 -0.336411
H  -0.757615 3.544195 0.326981
H  1.650731 3.477495 0.16053
H  -3.132566 -1.216082 -2.59365
H  -4.331162 -3.101258 -1.988334
H  -4.878787 -1.792657 -0.947698
H  -4.878154 2.330517 2.288516
H  -4.77235 0.762767 1.471975
H  -5.218574 2.193836 0.558939
H  -2.221289 -4.486596 -1.032947
H  -4.809379 -2.101647 1.39409
H  -1.49933 -5.652894 1.055227
H  -2.482224 -4.934992 3.219656
totalener: -1801.65491086 hartree
nucrepener: 3498.93932665 hartree
electener: -5300.59423751 hartree
oneelecener: -9437.53386101 hartree
twoeener: 4136.93962351 hartree
kineticenergy: 1795.06749982 hartree
xcener: -158.794929856432 hartree
chargesum: -0.0000000
charge: -0.187333 -0.162378 -0.148600 -0.142910 -0.149042 -0.150781 -0.155863 -0.388573 -0.357611 -0.024704 -0.093585 -0.168606 -0.285604 -0.030368 -0.082138 0.071797 -0.064794 0.175400 -0.098461 -0.133451 -0.109810 0.281910 0.476774 0.458081 0.303610 -0.097515 0.036434 -0.248861 -0.142526 -0.037339 -0.115200 0.015186 0.096877 0.112581 0.121878 0.135973 0.128810 0.123268 0.106609 0.122763 0.112852 0.089578 0.118909 0.131991 0.103711 0.128096 0.122964
qa: -0.1873 -0.1624 -0.1486 -0.1429 -0.1490 -0.1508 -0.1559 -0.3886 -0.3576 -0.0247 -0.0936 -0.1686 -0.2856 -0.0304 -0.0821 0.0718 -0.0648 0.1754 -0.0985 -0.1335 -0.1098 0.2819 0.4768 0.4581 0.3036 -0.0975 0.0364 -0.2489 -0.1425 -0.0373 -0.1152 0.0152 0.0969 0.1126 0.1219 0.1360 0.1288 0.1233 0.1066 0.1228 0.1129 0.0896 0.1189 0.1320 0.1037 0.1281 0.1230
va: 1.1132 1.1500 1.1696 1.1845 1.1749 1.1718 1.1607 2.1168 2.1221 3.1218 3.1233 2.9086 3.1031 3.8899 3.9003 3.9277 3.8187 4.0784 4.0157 4.0407 4.0597 4.3795 4.4783 4.4811 4.0859 3.9290 3.5048 3.8996 3.9620 4.0770 3.8985 4.0168 1.0196 0.9766 1.0361 1.0327 1.0213 1.0418 1.0063 1.0077 1.0156 1.0052 1.0118 1.0154 1.0131 1.0008 1.0007
dispcorr: -0.027069183 hartree
energy: -1801.681980043406
dipole: -61.47430 61.00745 -0.46685 -20.04576 18.48834 -1.55742 7.21648 -8.02827 -0.81179
magnitude: 1.81728 au
magnitude: 4.61916 debye
