program: Orca
programVersion: 5.0.2
elementType: F F F F F F F O O N N N N C C C C C C C C C C C C C C C C C C C H H H H H H H H H H H H H H H
charge: 0
multiplicity: 1
keywords: wb97x-d3
keywords: def2-TZVPP
keywords: def2/J RIJCOSX
keywords: DEFGRID2
keywords: scfconv7
keywords: smallprint printgap noloewdin
keywords: NOSOSCF
formula: C19H15F7N4O2
InChI: InChI=1/C19H15F7N4O2/c1-11(31)30-15-5-4-14(17(20,18(21,22)23)19(24,25)26)7-13(15)10-29(16(30)32)28-9-12-3-2-6-27-8-12/h2-8,28H,9-10H2,1H3
47 atoms
F  2.712428 -1.225698 -0.737997
F  3.30679 2.226834 -0.687118
F  2.910756 0.869607 -2.311293
F  4.72595 0.684451 -1.178713
F  4.499428 -0.907441 1.070039
F  2.611457 -0.803961 2.078562
F  3.756287 0.994079 1.743337
O  -4.788026 0.48533 0.464017
O  -2.437292 3.765991 0.767331
N  -3.278197 -0.329735 -1.008393
N  -2.805546 1.62504 0.136124
N  -3.946671 -1.524187 -1.204275
N  -0.415036 -2.393328 1.545189
C  -1.010268 0.401785 -0.853795
C  -2.076373 -0.084913 -1.781403
C  -1.42368 1.293797 0.126779
C  1.235968 0.463114 -0.002923
C  2.672383 0.011032 -0.138637
C  0.303519 -0.019709 -0.912964
C  -0.50522 1.763478 1.054511
C  0.816421 1.360048 0.97146
C  -3.721493 0.570141 -0.097662
C  3.429295 0.967306 -1.090517
C  3.400511 -0.178843 1.214468
C  -3.232752 2.933907 0.419774
C  -3.804763 -2.442988 -0.074272
C  -2.353863 -2.729952 0.172796
C  -4.687208 3.269241 0.2194
C  -1.592777 -3.469335 -0.724405
C  -1.701474 -2.214359 1.285968
C  -0.247413 -3.660698 -0.468724
C  0.293551 -3.10055 0.681534
H  -2.267399 0.650872 -2.57235
H  -1.796704 -1.018247 -2.261637
H  0.585121 -0.734411 -1.673532
H  -0.796575 2.435657 1.843762
H  1.501007 1.762832 1.702421
H  -4.923708 -1.333217 -1.389373
H  -4.333338 -3.35693 -0.354573
H  -4.272736 -2.067876 0.841557
H  -5.104469 2.856987 -0.697256
H  -4.765328 4.352821 0.190847
H  -5.289775 2.896105 1.044851
H  -2.052373 -3.886183 -1.61283
H  -2.257368 -1.624629 2.009346
H  0.375891 -4.233888 -1.141234
H  1.34348 -3.234546 0.912795
totalener: -1801.65384569 hartree
nucrepener: 3682.24346574 hartree
electener: -5483.89731143 hartree
oneelecener: -9804.91740835 hartree
twoeener: 4321.02009691 hartree
kineticenergy: 1795.08995047 hartree
xcener: -158.801628773138 hartree
chargesum: -0.0000000
charge: -0.198947 -0.149403 -0.156477 -0.150952 -0.148270 -0.141582 -0.159882 -0.387917 -0.356759 -0.023516 -0.090057 -0.176740 -0.276273 -0.022897 -0.115844 0.096009 -0.042635 0.185784 -0.151860 -0.120648 -0.092161 0.262288 0.470362 0.477139 0.304407 -0.081036 0.079767 -0.259086 -0.207323 -0.045009 -0.101884 0.013472 0.115241 0.113360 0.115146 0.129927 0.125028 0.123614 0.106716 0.127762 0.096948 0.111537 0.116902 0.133208 0.106786 0.128198 0.117555
qa: -0.1989 -0.1494 -0.1565 -0.1510 -0.1483 -0.1416 -0.1599 -0.3879 -0.3568 -0.0235 -0.0901 -0.1767 -0.2763 -0.0229 -0.1158 0.0960 -0.0426 0.1858 -0.1519 -0.1206 -0.0922 0.2623 0.4704 0.4771 0.3044 -0.0810 0.0798 -0.2591 -0.2073 -0.0450 -0.1019 0.0135 0.1152 0.1134 0.1151 0.1299 0.1250 0.1236 0.1067 0.1278 0.0969 0.1115 0.1169 0.1332 0.1068 0.1282 0.1176
va: 1.0966 1.1702 1.1659 1.1716 1.1771 1.1736 1.1562 2.1194 2.1232 3.1002 3.1050 2.9175 3.0473 3.7416 3.9330 3.8812 3.7653 4.0500 3.9741 4.0722 4.0568 4.4141 4.4942 4.4789 4.0838 3.8847 3.4654 3.8993 3.9842 4.0878 3.8447 3.9838 0.9927 1.0122 1.0351 1.0306 1.0270 1.0417 1.0059 1.0045 1.0056 1.0142 1.0111 1.0126 1.0125 1.0008 1.0127
dispcorr: -0.032080378 hartree
energy: -1801.685926068202
dipole: -54.81884 53.63975 -1.17909 -7.80404 6.78183 -1.02221 -3.06757 1.82209 -1.24547
magnitude: 1.99659 au
magnitude: 5.07493 debye
