program: Orca
programVersion: 5.0.2
elementType: O N N N N N C C C C C C C C C C H H H H H H H H H H H
charge: 0
multiplicity: 1
keywords: wb97x-d3
keywords: def2-TZVPP
keywords: def2/J RIJCOSX
keywords: DEFGRID2
keywords: scfconv7
keywords: smallprint printgap noloewdin
keywords: NOSOSCF
formula: C10H11N5O
InChI: InChI=1/C10H11N5O/c1-8-7-15(10(16)14-13-8)12-6-9-3-2-4-11-5-9/h2-6,14H,7H2,1H3
27 atoms
O  1.250832 -2.338653 0.025139
N  1.302617 -0.045869 0.181575
N  3.238684 -1.267067 0.020547
N  4.001112 -0.181229 -0.316459
N  -0.012919 0.245303 0.185857
N  -4.645015 -0.726805 -0.243921
C  2.139883 1.086441 0.549363
C  3.488485 0.959195 -0.079274
C  1.871637 -1.287314 0.074937
C  4.240157 2.202498 -0.383197
C  -0.953578 -0.597162 0.006476
C  -2.332698 -0.115262 -0.00702
C  -2.695206 1.222926 0.146833
C  -3.356747 -1.039913 -0.196135
C  -4.033959 1.558681 0.099236
C  -4.969627 0.552463 -0.100097
H  2.248471 1.1589 1.638597
H  1.646751 1.994976 0.211235
H  3.715039 2.792112 -1.136864
H  5.243999 1.987046 -0.741386
H  4.312306 2.82566 0.510715
H  3.66848 -2.149894 -0.214042
H  -0.820566 -1.659845 -0.150309
H  -1.941982 1.984591 0.297852
H  -3.111682 -2.090263 -0.315806
H  -4.356919 2.584286 0.211625
H  -6.025022 0.7929 -0.146519
elementType: O N C H
totalener: -736.69908335 hartree
nucrepener: 1020.99993702 hartree
electener: -1757.69902037 hartree
oneelecener: -3025.35921431 hartree
twoeener: 1267.66019394 hartree
cpcmener: -0.03251118 hartree
kineticenergy: 733.63539928 hartree
xcener: -70.281561538262 hartree
chargesum: 0.0000000
charge: -0.543070 0.002749 -0.079363 -0.231105 -0.262702 -0.377363 -0.017830 0.091030 0.397693 -0.241223 0.097312 -0.026493 -0.141828 0.010449 -0.150309 0.028391 0.119191 0.107856 0.107174 0.093813 0.107252 0.187686 0.134315 0.148034 0.130679 0.158846 0.148819
qa: -0.5431 0.0027 -0.0794 -0.2311 -0.2627 -0.3774 -0.0178 0.0910 0.3977 -0.2412 0.0973 -0.0265 -0.1418 0.0104 -0.1503 0.0284 0.1192 0.1079 0.1072 0.0938 0.1073 0.1877 0.1343 0.1480 0.1307 0.1588 0.1488
va: 1.9646 3.1322 3.1771 2.9650 2.9841 3.0569 3.8989 3.9736 4.3909 3.9386 3.9340 3.6596 3.9583 4.0574 3.9182 3.9816 0.9951 1.0092 0.9961 1.0186 0.9960 1.0099 1.0272 1.0209 1.0120 0.9919 0.9985
dispcorr: -0.009184630 hartree
energy: -736.708267976021
dipole: 4.34784 -3.15632 1.19152 9.55394 -6.93810 2.61583 0.17871 0.16314 0.34185
magnitude: 2.89468 au
magnitude: 7.35769 debye
