program: Orca
programVersion: 5.0.2
elementType: O N N N N N C C C C C C C C C C H H H H H H H H H H H
charge: 0
multiplicity: 1
keywords: wb97x-d3
keywords: def2-TZVPP
keywords: def2/J RIJCOSX
keywords: DEFGRID2
keywords: scfconv7
keywords: smallprint printgap noloewdin
keywords: NOSOSCF
formula: C10H11N5O
InChI: InChI=1/C10H11N5O/c1-8-7-15(10(16)14-13-8)12-6-9-3-2-4-11-5-9/h2-6,14H,7H2,1H3
27 atoms
O  1.265041 -2.339045 -0.023947
N  1.28347 -0.048102 0.153941
N  3.242664 -1.246645 0.05336
N  3.996614 -0.161546 -0.268939
N  -0.035174 0.226144 0.141911
N  -3.963835 1.582738 0.075647
C  2.094788 1.09964 0.514078
C  3.467713 0.973118 -0.0715
C  1.864289 -1.290168 0.057807
C  4.231662 2.213388 -0.381108
C  -0.956551 -0.638277 -0.01508
C  -2.346961 -0.184419 -0.032624
C  -3.370979 -1.11363 -0.176209
C  -2.713997 1.159043 0.0887
C  -4.684797 -0.677531 -0.191426
C  -4.928157 0.67983 -0.061575
H  2.165567 1.206631 1.605916
H  1.59058 1.989675 0.140339
H  3.739685 2.789931 -1.167217
H  5.240726 1.972261 -0.705786
H  4.293432 2.861303 0.496494
H  3.683591 -2.124642 -0.166415
H  -0.78816 -1.701478 -0.13876
H  -3.1397 -2.167785 -0.274878
H  -1.946003 1.915299 0.201029
H  -5.504737 -1.373631 -0.30195
H  -5.943776 1.059403 -0.06892
totalener: -736.67764443 hartree
nucrepener: 1021.87618546 hartree
electener: -1758.55382989 hartree
oneelecener: -3026.93556801 hartree
twoeener: 1268.38173812 hartree
kineticenergy: 733.69567123 hartree
xcener: -70.286528746160 hartree
chargesum: 0.0000000
charge: -0.418380 -0.014386 -0.092592 -0.162223 -0.241267 -0.293482 -0.037512 0.055809 0.353901 -0.238545 0.082251 -0.017102 -0.103444 -0.008242 -0.130250 0.021788 0.096639 0.094371 0.093589 0.102532 0.090182 0.164430 0.129146 0.120404 0.111807 0.122537 0.118040
qa: -0.4184 -0.0144 -0.0926 -0.1622 -0.2413 -0.2935 -0.0375 0.0558 0.3539 -0.2385 0.0823 -0.0171 -0.1034 -0.0082 -0.1303 0.0218 0.0966 0.0944 0.0936 0.1025 0.0902 0.1644 0.1291 0.1204 0.1118 0.1225 0.1180
va: 2.0983 3.1383 3.1761 2.9969 2.9838 3.0957 3.9222 3.9628 4.4006 3.9291 3.9215 3.6785 3.9920 4.0835 3.9137 4.0199 0.9956 1.0099 0.9980 1.0200 0.9980 1.0257 1.0347 1.0118 1.0283 1.0028 1.0011
dispcorr: -0.009183772 hartree
energy: -736.686828198478
dipole: 3.28121 -2.76703 0.51418 5.96496 -5.71191 0.25306 -0.26968 0.30510 0.03542
magnitude: 0.57417 au
magnitude: 1.45943 debye
