program: Orca
programVersion: 5.0.2
elementType: O O O O O O O O O N C C C C C C C C C C C C C C C C C C C C C C C C C C C C C C C C C H H H H H H H H H H H H H H H H H H H H H H H H H H H H H H H H H H H H H H H
charge: 0
multiplicity: 1
keywords: wb97x-d3
keywords: def2-TZVPP
keywords: def2/J RIJCOSX
keywords: DEFGRID2
keywords: scfconv7
keywords: smallprint printgap noloewdin
keywords: NOSOSCF
formula: C33H39NO9
InChI: InChI=1/C33H39NO9/c1-31-11-10-24(42-29(38)18-8-9-18)32(2,16-40-28(37)17-6-7-17)22(31)14-23(35)33(3)27(31)26(36)25-21(43-33)13-20(41-30(25)39)19-5-4-12-34-15-19/h4-5,12-13,15,17-18,22-24,26-27,35-36H,6-11,14,16H2,1-3H3
82 atoms
O  -2.242219 -0.039093 -1.400071
O  5.066998 1.186683 0.939676
O  -0.466924 -0.107259 -3.669471
O  -1.750704 2.984273 0.8425
O  3.686091 -1.481856 -0.85981
O  -4.992426 0.197201 1.533331
O  5.227939 -0.053829 2.800388
O  -3.779547 1.552197 2.761853
O  3.102731 -2.360621 -2.842472
N  -8.182962 -2.529538 -0.657088
C  0.902629 1.706776 -0.02501
C  1.805587 0.740542 -0.845917
C  -0.516138 1.057528 -0.075621
C  3.339806 0.94448 -0.715757
C  -1.088109 0.85131 -1.490246
C  1.303145 0.65463 -2.286303
C  1.370701 1.678492 1.438666
C  -0.081192 0.034204 -2.319757
C  3.659796 0.927827 0.789621
C  2.862507 1.937291 1.591828
C  -1.557018 1.584741 0.919879
C  0.961625 3.156955 -0.536194
C  4.087228 -0.217205 -1.397026
C  3.869973 2.20287 -1.411732
C  -1.574461 2.097467 -2.21433
C  -2.845457 0.839076 0.714507
C  -3.088728 0.080757 -0.395861
C  5.731371 0.659216 1.959089
C  -3.839749 0.912741 1.729145
C  7.153656 1.050024 1.937415
C  -4.296809 -0.665776 -0.524057
C  7.84789 1.240325 3.263564
C  8.162952 0.048896 2.444068
C  3.167212 -2.427756 -1.634569
C  2.675503 -3.565117 -0.834663
C  -5.216489 -0.573055 0.455811
C  1.3724 -4.194743 -1.271763
C  2.642058 -4.926831 -1.478383
C  -6.510265 -1.256339 0.500052
C  -7.269821 -1.310098 1.668168
C  -7.030336 -1.8808 -0.634911
C  -8.477074 -1.985112 1.648735
C  -8.888354 -2.581433 0.469415
H  1.621131 -0.243867 -0.395382
H  -0.34509 0.036392 0.294102
H  1.292165 1.63535 -2.767956
H  1.951361 0.029315 -2.899198
H  1.140284 0.699453 1.873407
H  0.822334 2.417751 2.026911
H  -0.008744 -0.955615 -1.842912
H  3.435109 -0.069732 1.177606
H  3.121325 2.955151 1.291275
H  3.128436 1.852447 2.647751
H  -1.188012 1.329396 1.919828
H  0.06551 3.712009 -0.281795
H  1.09505 3.23498 -1.612996
H  1.794166 3.694706 -0.086301
H  5.159245 -0.127067 -1.216098
H  3.94442 -0.18697 -2.476178
H  4.95564 2.167694 -1.515265
H  3.46098 2.290942 -2.418459
H  3.629369 3.120428 -0.881016
H  -2.2662 2.676191 -1.605486
H  -2.091628 1.827684 -3.134242
H  -0.749367 2.751169 -2.485697
H  -1.270484 -0.636998 -3.710414
H  -2.275168 3.248087 1.606833
H  7.457964 1.691853 1.121366
H  -4.452546 -1.291349 -1.390182
H  7.256081 1.108117 4.159738
H  8.571906 2.042151 3.312778
H  9.107524 0.015738 1.918546
H  7.790403 -0.91373 2.76862
H  2.86606 -3.517247 0.229203
H  0.709082 -4.516529 -0.480628
H  0.876523 -3.76669 -2.133269
H  3.029207 -5.013147 -2.485082
H  2.86626 -5.765341 -0.833354
H  -6.930949 -0.844988 2.583392
H  -6.495211 -1.845532 -1.576097
H  -9.089634 -2.05124 2.536675
H  -9.82629 -3.121535 0.428261
elementType: O N C H
totalener: -2013.00479903 hartree
nucrepener: 5431.46731656 hartree
electener: -7444.47211559 hartree
twoeener: 6110.81356786 hartree
cpcmener: -0.07551114 hartree
kineticenergy: 2004.18838955 hartree
xcener: -192.185243477063 hartree
chargesum: -0.0000000
charge: -0.335603 -0.318703 -0.437171 -0.425343 -0.305469 -0.233176 -0.519361 -0.520451 -0.505611 -0.373301 0.629037 -0.295483 -0.236403 0.435913 0.472133 -0.314072 -0.358591 0.078743 0.100090 -0.244604 0.134842 -0.454957 -0.108809 -0.408771 -0.377638 -0.294880 0.305029 0.461995 0.381664 -0.131041 -0.256269 -0.151836 -0.152005 0.433234 -0.096141 0.375490 -0.162402 -0.149284 -0.043979 -0.125836 0.010799 -0.157558 0.044078 0.107725 0.125837 0.110260 0.096407 0.109744 0.089183 0.105565 0.099655 0.092315 0.092512 0.118853 0.119015 0.109627 0.114441 0.126967 0.134106 0.109405 0.119021 0.113930 0.113160 0.104486 0.122219 0.233440 0.222940 0.103524 0.139162 0.094538 0.104687 0.104618 0.094033 0.105902 0.105401 0.097002 0.091972 0.106627 0.155494 0.128132 0.158944 0.150853
qa: -0.3356 -0.3187 -0.4372 -0.4253 -0.3055 -0.2332 -0.5194 -0.5205 -0.5056 -0.3733 0.6290 -0.2955 -0.2364 0.4359 0.4721 -0.3141 -0.3586 0.0787 0.1001 -0.2446 0.1348 -0.4550 -0.1088 -0.4088 -0.3776 -0.2949 0.3050 0.4620 0.3817 -0.1310 -0.2563 -0.1518 -0.1520 0.4332 -0.0961 0.3755 -0.1624 -0.1493 -0.0440 -0.1258 0.0108 -0.1576 0.0441 0.1077 0.1258 0.1103 0.0964 0.1097 0.0892 0.1056 0.0997 0.0923 0.0925 0.1189 0.1190 0.1096 0.1144 0.1270 0.1341 0.1094 0.1190 0.1139 0.1132 0.1045 0.1222 0.2334 0.2229 0.1035 0.1392 0.0945 0.1047 0.1046 0.0940 0.1059 0.1054 0.0970 0.0920 0.1066 0.1555 0.1281 0.1589 0.1509
va: 2.1725 2.1337 2.0073 1.9625 2.1161 2.2100 1.9807 1.9948 1.9947 3.0624 3.3268 4.0574 3.8745 3.6354 3.6152 3.8459 3.9747 4.0076 3.6875 4.0035 3.9804 3.9277 3.8070 3.9627 3.9445 3.6057 4.0878 4.0689 4.3172 3.8292 4.0379 3.9043 3.8998 4.1022 3.7927 3.7977 3.9031 3.9225 3.6908 3.9527 4.0623 3.9251 3.9737 1.0173 1.0158 1.0173 1.0486 0.9940 1.0237 1.0211 1.0459 1.0123 1.0300 1.0055 1.0354 0.9912 1.0011 1.0148 1.0120 1.0082 0.9960 0.9969 1.0301 1.0284 0.9918 1.0042 1.0189 1.0218 1.0205 1.0259 1.0165 1.0167 1.0258 1.0204 1.0159 1.0224 1.0265 1.0162 1.0150 1.0146 0.9937 0.9972
dispcorr: -0.053583432 hartree
energy: -2013.058382458960
dipole: 41.49211 -41.02027 0.47184 9.69135 -10.20188 -0.51053 -6.15134 6.28487 0.13353
magnitude: 0.70789 au
magnitude: 1.79931 debye
