program: Orca
programVersion: 5.0.2
elementType: O O O O O O O O O N C C C C C C C C C C C C C C C C C C C C C C C C C C C C C C C C C H H H H H H H H H H H H H H H H H H H H H H H H H H H H H H H H H H H H H H H
charge: 0
multiplicity: 1
keywords: wb97x-d3
keywords: def2-TZVPP
keywords: def2/J RIJCOSX
keywords: DEFGRID2
keywords: scfconv7
keywords: smallprint printgap noloewdin
keywords: NOSOSCF
formula: C33H39NO9
InChI: InChI=1/C33H39NO9/c1-31-11-10-24(42-29(38)18-8-9-18)32(2,16-40-28(37)17-6-7-17)22(31)14-23(35)33(3)27(31)26(36)25-21(43-33)13-20(41-30(25)39)19-5-4-12-34-15-19/h4-5,12-13,15,17-18,22-24,26-27,35-36H,6-11,14,16H2,1-3H3
82 atoms
O  -2.532614 0.210588 -1.447401
O  4.888449 0.782682 0.823666
O  -0.821189 0.463116 -3.753709
O  -1.818824 2.763167 1.279071
O  3.440443 -1.504664 -1.381152
O  -5.203196 0.081159 1.568655
O  5.067266 -0.809441 2.388562
O  -3.889278 1.142154 2.969587
O  5.487135 -2.093315 -0.663296
N  -8.391183 -2.510996 -0.751528
C  0.722889 1.566436 0.087839
C  1.571125 0.718433 -0.906199
C  -0.719286 0.980137 -0.016405
C  3.115483 0.873447 -0.796885
C  -1.338327 1.050615 -1.422574
C  1.024536 0.870396 -2.325314
C  1.2305 1.295591 1.513192
C  -0.396709 0.344071 -2.413158
C  3.472248 0.602235 0.674318
C  2.732695 1.487558 1.657179
C  -1.70454 1.364884 1.094991
C  0.816011 3.078275 -0.190095
C  3.82728 -0.16081 -1.688434
C  3.649219 2.223676 -1.290062
C  -1.783124 2.423037 -1.903978
C  -3.039479 0.738044 0.803944
C  -3.351862 0.202908 -0.414198
C  5.574199 0.016028 1.658393
C  -4.008099 0.69316 1.845523
C  7.02673 0.266507 1.610004
C  -4.618163 -0.413707 -0.641436
C  7.70415 0.552109 0.290431
C  7.572073 1.636562 1.290362
C  4.315574 -2.347628 -0.838046
C  3.677243 -3.622896 -0.464781
C  -5.503051 -0.452287 0.372645
C  4.538684 -4.856719 -0.400091
C  4.090267 -4.224527 0.860433
C  -6.851614 -1.016518 0.319434
C  -7.845922 -0.617667 1.211117
C  -7.185452 -1.977966 -0.634393
C  -9.106705 -1.173741 1.093508
C  -9.332252 -2.108458 0.097231
H  1.3780 -0.322064 -0.612674
H  -0.577662 -0.094981 0.163863
H  1.065459 1.908821 -2.662458
H  1.618258 0.295423 -3.037398
H  0.982723 0.26674 1.797783
H  0.72119 1.94733 2.2265
H  -0.371536 -0.714815 -2.116517
H  3.213686 -0.435301 0.908114
H  3.016839 2.533548 1.521916
H  3.027594 1.218215 2.673836
H  -1.324078 0.911971 2.017856
H  0.951531 3.320448 -1.242008
H  1.659307 3.521961 0.336264
H  -0.067459 3.606344 0.150693
H  4.907216 -0.044746 -1.60576
H  3.574818 0.001364 -2.735876
H  3.431378 3.044883 -0.613034
H  4.732367 2.194492 -1.419153
H  3.223525 2.477412 -2.260947
H  -2.345103 2.335954 -2.832936
H  -0.936389 3.076465 -2.09612
H  -2.423818 2.91942 -1.177724
H  -1.651787 -0.012729 -3.860751
H  -2.311953 2.911153 2.093652
H  7.583631 -0.326706 2.323194
H  -4.86317 -0.807563 -1.61686
H  7.089161 0.591097 -0.598843
H  8.67332 0.093851 0.14689
H  8.450244 1.936261 1.846232
H  6.867344 2.434526 1.099619
H  2.643802 -3.745528 -0.760473
H  4.070337 -5.781592 -0.708121
H  5.577386 -4.757336 -0.686502
H  4.812391 -3.676741 1.45166
H  3.30609 -4.701935 1.431869
H  -7.65291 0.12224 1.975694
H  -6.436177 -2.345949 -1.32535
H  -9.90547 -0.884507 1.761611
H  -10.311962 -2.555414 -0.019609
elementType: O N C H
totalener: -2013.00430328 hartree
nucrepener: 5436.40734245 hartree
electener: -7449.41164572 hartree
twoeener: 6116.24803527 hartree
cpcmener: -0.07674182 hartree
kineticenergy: 2004.19253090 hartree
xcener: -192.187217044516 hartree
chargesum: -0.0000000
charge: -0.334313 -0.295402 -0.434487 -0.424143 -0.308084 -0.234375 -0.512491 -0.519614 -0.503520 -0.373372 0.611134 -0.294865 -0.207463 0.409798 0.470333 -0.282959 -0.355467 0.059554 0.097926 -0.255143 0.122961 -0.465200 -0.104083 -0.405357 -0.378188 -0.289418 0.305519 0.413659 0.387150 -0.096664 -0.269328 -0.171991 -0.150500 0.425025 -0.085662 0.387334 -0.145791 -0.159908 -0.047550 -0.125619 0.009962 -0.157829 0.042733 0.119621 0.123963 0.098999 0.094421 0.109247 0.090757 0.113008 0.098997 0.095240 0.091023 0.118644 0.110489 0.112771 0.121374 0.121245 0.142618 0.116363 0.107095 0.123374 0.103056 0.122505 0.113651 0.233051 0.222209 0.101990 0.141030 0.100884 0.104835 0.103649 0.097217 0.105591 0.105786 0.091559 0.091563 0.104067 0.155158 0.129324 0.158866 0.150457
qa: -0.3343 -0.2954 -0.4345 -0.4241 -0.3081 -0.2344 -0.5125 -0.5196 -0.5035 -0.3734 0.6111 -0.2949 -0.2075 0.4098 0.4703 -0.2830 -0.3555 0.0596 0.0979 -0.2551 0.1230 -0.4652 -0.1041 -0.4054 -0.3782 -0.2894 0.3055 0.4137 0.3872 -0.0967 -0.2693 -0.1720 -0.1505 0.4250 -0.0857 0.3873 -0.1458 -0.1599 -0.0476 -0.1256 0.0100 -0.1578 0.0427 0.1196 0.1240 0.0990 0.0944 0.1092 0.0908 0.1130 0.0990 0.0952 0.0910 0.1186 0.1105 0.1128 0.1214 0.1212 0.1426 0.1164 0.1071 0.1234 0.1031 0.1225 0.1137 0.2331 0.2222 0.1020 0.1410 0.1009 0.1048 0.1036 0.0972 0.1056 0.1058 0.0916 0.0916 0.1041 0.1552 0.1293 0.1589 0.1505
va: 2.1730 2.1030 2.0130 1.9629 2.1134 2.2089 1.9707 1.9959 1.9930 3.0641 3.3351 4.0167 3.8546 3.6544 3.5936 3.8881 3.9689 4.0331 3.7009 4.0300 3.9795 3.9442 3.8173 3.9561 3.9462 3.6089 4.0749 4.1108 4.3139 3.8032 4.0179 3.9152 3.9039 4.0946 3.7896 3.7763 3.9182 3.9039 3.6922 3.9508 4.0649 3.9281 3.9764 1.0088 1.0156 1.0141 1.0383 0.9946 1.0254 1.0135 1.0347 1.0108 1.0300 1.0043 0.9895 1.0013 1.0327 1.0294 1.0007 0.9955 1.0058 0.9975 1.0294 0.9914 1.0289 1.0047 1.0196 1.0186 1.0172 1.0141 1.0157 1.0166 1.0205 1.0201 1.0162 1.0264 1.0327 1.0158 1.0131 1.0117 0.9935 0.9975
dispcorr: -0.055243685 hartree
energy: -2013.059546962606
dipole: 42.57476 -43.55287 -0.97811 12.05864 -11.83179 0.22685 -8.25293 6.52477 -1.72815
magnitude: 1.99867 au
magnitude: 5.08021 debye
