program: Orca
programVersion: 5.0.2
elementType: O O O O O O O O O N C C C C C C C C C C C C C C C C C C C C C C C C C C C C C C C C C H H H H H H H H H H H H H H H H H H H H H H H H H H H H H H H H H H H H H H H
charge: 0
multiplicity: 1
keywords: wb97x-d3
keywords: def2-TZVPP
keywords: def2/J RIJCOSX
keywords: DEFGRID2
keywords: scfconv7
keywords: smallprint printgap noloewdin
keywords: NOSOSCF
formula: C33H39NO9
InChI: InChI=1/C33H39NO9/c1-31-11-10-24(42-29(38)18-8-9-18)32(2,16-40-28(37)17-6-7-17)22(31)14-23(35)33(3)27(31)26(36)25-21(43-33)13-20(41-30(25)39)19-5-4-12-34-15-19/h4-5,12-13,15,17-18,22-24,26-27,35-36H,6-11,14,16H2,1-3H3
82 atoms
O  -2.569806 0.169418 -1.475728
O  4.856624 0.986568 0.672226
O  -1.010943 0.376594 -3.766564
O  -1.894666 2.872804 1.125286
O  3.437116 -1.363358 -1.445901
O  -5.212827 0.138431 1.564725
O  5.069384 -0.637094 2.20305
O  -3.904912 1.280282 2.907558
O  5.527341 -1.91905 -0.838837
N  -8.619005 -2.092529 -0.840454
C  0.666387 1.679999 -0.040324
C  1.523236 0.818343 -1.014414
C  -0.763612 1.057918 -0.104274
C  3.062904 1.017248 -0.930033
C  -1.404509 1.045223 -1.505115
C  0.951988 0.905443 -2.427616
C  1.197095 1.472315 1.388482
C  -0.455595 0.328701 -2.469706
C  3.439178 0.792675 0.54372
C  2.698037 1.696811 1.507517
C  -1.747022 1.470796 0.999516
C  0.71677 3.182552 -0.373682
C  3.792045 -0.022987 -1.79906
C  3.558377 2.366292 -1.464244
C  -1.896122 2.385804 -2.034923
C  -3.068857 0.79982 0.751843
C  -3.377266 0.193247 -0.432919
C  5.560266 0.198029 1.473697
C  -4.025067 0.779411 1.805497
C  7.006438 0.463833 1.359359
C  -4.618713 -0.487986 -0.607141
C  7.871447 0.220682 2.568932
C  7.930667 -0.727893 1.433796
C  4.350088 -2.187449 -0.936849
C  3.744766 -3.458528 -0.500105
C  -5.503384 -0.480738 0.408336
C  4.610513 -4.691679 -0.495432
C  4.261317 -4.050611 0.791707
C  -6.829283 -1.10132 0.411691
C  -7.547474 -1.285825 1.592497
C  -7.427499 -1.521095 -0.7772
C  -8.794771 -1.880116 1.530411
C  -9.286053 -2.269171 0.296193
H  1.360626 -0.216055 -0.682451
H  -0.596935 -0.004257 0.123975
H  0.951862 1.930719 -2.804262
H  1.552268 0.323392 -3.13064
H  0.971838 0.450223 1.713213
H  0.683456 2.140651 2.083194
H  -0.387574 -0.714392 -2.124846
H  3.192328 -0.240024 0.808383
H  2.960081 2.743265 1.336577
H  3.010997 1.464661 2.52817
H  -1.346123 1.068855 1.936943
H  1.557059 3.665166 0.122188
H  -0.173903 3.699996 -0.036379
H  0.828305 3.390041 -1.435738
H  4.869016 0.119845 -1.72535
H  3.529779 0.104718 -2.849183
H  3.111257 2.588936 -2.433094
H  3.334583 3.198484 -0.802977
H  4.639614 2.357152 -1.610022
H  -2.491824 2.245658 -2.935607
H  -1.071218 3.046579 -2.289008
H  -2.51889 2.902507 -1.307396
H  -0.427801 -0.114575 -4.355198
H  -2.3847 3.041808 1.937843
H  7.289078 1.269465 0.694628
H  -4.829304 -0.992049 -1.538591
H  7.379253 -0.096757 3.478892
H  8.694254 0.907401 2.714211
H  8.792149 -0.706144 0.780334
H  7.476174 -1.702913 1.553345
H  2.691769 -3.583556 -0.715052
H  4.12046 -5.618562 -0.761223
H  5.623809 -4.592134 -0.861785
H  5.02911 -3.499617 1.319564
H  3.525282 -4.523589 1.427282
H  -7.145448 -0.981407 2.548704
H  -6.92667 -1.377447 -1.726864
H  -9.377196 -2.041577 2.426366
H  -10.258404 -2.739794 0.217728
elementType: O N C H
totalener: -2013.00455649 hartree
nucrepener: 5419.63563072 hartree
electener: -7432.64018721 hartree
twoeener: 6100.14326602 hartree
cpcmener: -0.07786942 hartree
kineticenergy: 2004.19633770 hartree
xcener: -192.187910389722 hartree
chargesum: 0.0000000
charge: -0.324960 -0.313389 -0.424065 -0.424458 -0.306877 -0.233623 -0.514904 -0.520797 -0.501125 -0.373037 0.605538 -0.300586 -0.229919 0.427210 0.543892 -0.324737 -0.362628 0.027517 0.121189 -0.253207 0.130619 -0.459714 -0.102799 -0.405717 -0.377434 -0.296322 0.306660 0.418552 0.383767 -0.108941 -0.255786 -0.148911 -0.162130 0.421814 -0.084229 0.379633 -0.146559 -0.159232 -0.045087 -0.126818 0.011655 -0.156801 0.043254 0.120907 0.125086 0.095855 0.097814 0.110586 0.090476 0.109054 0.095814 0.094741 0.092243 0.118759 0.111941 0.121519 0.110348 0.118688 0.141803 0.121739 0.115138 0.109989 0.104719 0.121442 0.113659 0.229037 0.221944 0.102687 0.137834 0.092943 0.105454 0.104514 0.095769 0.104792 0.105904 0.091885 0.090911 0.104781 0.155248 0.127687 0.158977 0.150806
qa: -0.3250 -0.3134 -0.4241 -0.4245 -0.3069 -0.2336 -0.5149 -0.5208 -0.5011 -0.3730 0.6055 -0.3006 -0.2299 0.4272 0.5439 -0.3247 -0.3626 0.0275 0.1212 -0.2532 0.1306 -0.4597 -0.1028 -0.4057 -0.3774 -0.2963 0.3067 0.4186 0.3838 -0.1089 -0.2558 -0.1489 -0.1621 0.4218 -0.0842 0.3796 -0.1466 -0.1592 -0.0451 -0.1268 0.0117 -0.1568 0.0433 0.1209 0.1251 0.0959 0.0978 0.1106 0.0905 0.1091 0.0958 0.0947 0.0922 0.1188 0.1119 0.1215 0.1103 0.1187 0.1418 0.1217 0.1151 0.1100 0.1047 0.1214 0.1137 0.2290 0.2219 0.1027 0.1378 0.0929 0.1055 0.1045 0.0958 0.1048 0.1059 0.0919 0.0909 0.1048 0.1552 0.1277 0.1590 0.1508
va: 2.1948 2.1200 2.0216 1.9615 2.1126 2.2099 1.9705 1.9942 1.9915 3.0630 3.3455 4.0009 3.9104 3.5956 3.5868 3.9929 3.9648 4.0641 3.6601 4.0298 3.9802 3.9379 3.8020 3.9542 3.9400 3.6053 4.0802 4.1063 4.3139 3.7940 4.0312 3.9114 3.9075 4.0962 3.7878 3.7914 3.9175 3.9089 3.6901 3.9536 4.0626 3.9252 3.9747 1.0083 1.0147 1.0136 1.0290 0.9938 1.0254 1.0223 1.0396 1.0106 1.0270 1.0041 1.0018 1.0332 0.9899 1.0364 0.9984 0.9971 0.9961 1.0081 1.0271 0.9927 1.0296 1.0059 1.0202 1.0227 1.0223 1.0264 1.0169 1.0161 1.0228 1.0201 1.0162 1.0264 1.0256 1.0159 1.0149 1.0143 0.9936 0.9974
dispcorr: -0.054335032 hartree
energy: -2013.058891517627
dipole: 44.45777 -43.95456 0.50321 8.71114 -9.34607 -0.63493 -6.48708 4.91643 -1.57065
magnitude: 1.76729 au
magnitude: 4.49210 debye
