program: Orca
programVersion: 5.0.2
elementType: O O O O O O O O O N C C C C C C C C C C C C C C C C C C C C C C C C C C C C C C C C C H H H H H H H H H H H H H H H H H H H H H H H H H H H H H H H H H H H H H H H
charge: 0
multiplicity: 1
keywords: wb97x-d3
keywords: def2-TZVPP
keywords: def2/J RIJCOSX
keywords: DEFGRID2
keywords: scfconv7
keywords: smallprint printgap noloewdin
keywords: NOSOSCF
formula: C33H39NO9
InChI: InChI=1/C33H39NO9/c1-31-11-10-24(42-29(38)18-8-9-18)32(2,16-40-28(37)17-6-7-17)22(31)14-23(35)33(3)27(31)26(36)25-21(43-33)13-20(41-30(25)39)19-5-4-12-34-15-19/h4-5,12-13,15,17-18,22-24,26-27,35-36H,6-11,14,16H2,1-3H3
82 atoms
O  -2.447524 0.049772 -1.407099
O  4.883412 1.12402 0.931259
O  -0.723292 0.177741 -3.704395
O  -1.913359 2.887556 1.079462
O  3.559123 -1.317195 -1.142763
O  -5.18748 0.102048 1.547878
O  5.28734 -0.952836 1.686709
O  -3.954857 1.35263 2.86397
O  5.599516 -2.143221 -1.546874
N  -9.022288 -1.227802 1.113419
C  0.706971 1.701993 0.043021
C  1.60615 0.816211 -0.869914
C  -0.706519 1.045079 -0.029071
C  3.138438 1.052304 -0.755476
C  -1.30202 0.954061 -1.445072
C  1.078174 0.820438 -2.302288
C  1.205807 1.565226 1.491553
C  -0.310408 0.210609 -2.355904
C  3.477524 0.890601 0.737667
C  2.69883 1.824963 1.639622
C  -1.73255 1.485122 1.024848
C  0.733702 3.18867 -0.358181
C  3.916484 0.001556 -1.561035
C  3.621393 2.391365 -1.324717
C  -1.809732 2.252268 -2.054199
C  -3.032572 0.77332 0.769031
C  -3.289001 0.1021 -0.39347
C  5.675811 0.147796 1.359171
C  -4.025932 0.790576 1.78796
C  7.090054 0.563633 1.36754
C  -4.514778 -0.602821 -0.579098
C  8.031712 -0.141845 2.306702
C  8.093826 -0.447529 0.859686
C  4.473787 -2.276647 -1.117019
C  3.979724 -3.529383 -0.516358
C  -5.424918 -0.573798 0.411587
C  2.993254 -3.497103 0.625365
C  2.546987 -3.967239 -0.705981
C  -6.741495 -1.209995 0.377064
C  -6.981073 -2.33131 -0.414591
C  -7.804647 -0.704848 1.125707
C  -8.248511 -2.880967 -0.427626
C  -9.233886 -2.294932 0.350988
H  1.455384 -0.204184 -0.493028
H  -0.523614 -0.001706 0.253175
H  1.06891 1.827405 -2.72722
H  1.713588 0.22044 -2.955539
H  0.993235 0.552045 1.850372
H  0.660742 2.248622 2.146451
H  -0.232574 -0.812959 -1.960013
H  3.235679 -0.131157 1.038405
H  2.944158 2.868559 1.43015
H  2.990155 1.641198 2.676437
H  -1.353316 1.136018 1.992364
H  -0.184801 3.697037 -0.08784
H  0.889471 3.347508 -1.423037
H  1.536999 3.717619 0.152074
H  4.987814 0.162664 -1.435423
H  3.710977 0.097205 -2.628806
H  3.214703 2.56021 -2.322203
H  3.345807 3.244823 -0.712269
H  4.708299 2.405979 -1.420552
H  -2.360385 2.052267 -2.972454
H  -0.993785 2.92522 -2.305234
H  -2.477894 2.782859 -1.378761
H  -1.529145 -0.345767 -3.770533
H  -2.421307 3.084951 1.874237
H  7.283779 1.604615 1.145539
H  -4.715232 -1.115256 -1.508775
H  7.6103 -0.883555 2.972366
H  8.815908 0.463084 2.74084
H  8.916262 -0.05228 0.279312
H  7.710143 -1.398332 0.513534
H  4.727714 -4.310902 -0.492821
H  3.150217 -4.228482 1.406571
H  2.649012 -2.532974 0.975257
H  1.893003 -3.331903 -1.288228
H  2.393763 -5.027362 -0.856062
H  -6.187163 -2.779685 -0.997588
H  -7.673086 0.169277 1.751288
H  -8.470863 -3.754435 -1.02395
H  -10.235752 -2.706734 0.361933
elementType: O N C H
totalener: -2013.00409999 hartree
nucrepener: 5455.70864100 hartree
electener: -7468.71274100 hartree
twoeener: 6134.99172311 hartree
cpcmener: -0.07956866 hartree
kineticenergy: 2004.20292482 hartree
xcener: -192.188306061112 hartree
chargesum: -0.0000000
charge: -0.335894 -0.326014 -0.435290 -0.424820 -0.281214 -0.234951 -0.506479 -0.518547 -0.504932 -0.373753 0.618619 -0.296411 -0.215788 0.404793 0.473305 -0.286949 -0.356023 0.059619 0.165042 -0.273634 0.119228 -0.458865 -0.109481 -0.409535 -0.377043 -0.288319 0.309225 0.425369 0.387861 -0.117002 -0.275406 -0.145548 -0.157612 0.412866 -0.093978 0.391646 -0.166409 -0.152193 -0.044492 -0.118354 0.003842 -0.164872 0.043061 0.107822 0.124743 0.099753 0.094513 0.110005 0.089945 0.113901 0.092759 0.095433 0.090950 0.118957 0.120726 0.109895 0.112491 0.120244 0.143178 0.121190 0.116233 0.109669 0.103985 0.122020 0.113707 0.233150 0.223034 0.102891 0.141521 0.091009 0.104912 0.104715 0.091850 0.103273 0.105750 0.102309 0.097427 0.104556 0.154901 0.132567 0.159259 0.150088
qa: -0.3359 -0.3260 -0.4353 -0.4248 -0.2812 -0.2350 -0.5065 -0.5185 -0.5049 -0.3738 0.6186 -0.2964 -0.2158 0.4048 0.4733 -0.2869 -0.3560 0.0596 0.1650 -0.2736 0.1192 -0.4589 -0.1095 -0.4095 -0.3770 -0.2883 0.3092 0.4254 0.3879 -0.1170 -0.2754 -0.1455 -0.1576 0.4129 -0.0940 0.3916 -0.1664 -0.1522 -0.0445 -0.1184 0.0038 -0.1649 0.0431 0.1078 0.1247 0.0998 0.0945 0.1100 0.0899 0.1139 0.0928 0.0954 0.0909 0.1190 0.1207 0.1099 0.1125 0.1202 0.1432 0.1212 0.1162 0.1097 0.1040 0.1220 0.1137 0.2331 0.2230 0.1029 0.1415 0.0910 0.1049 0.1047 0.0919 0.1033 0.1058 0.1023 0.0974 0.1046 0.1549 0.1326 0.1593 0.1501
va: 2.1709 2.1183 2.0120 1.9618 2.0964 2.2071 1.9891 1.9971 1.9841 3.0609 3.3144 4.0541 3.8611 3.6318 3.5836 3.8899 3.9451 4.0205 3.6322 4.0546 3.9864 3.9396 3.7839 3.9506 3.9482 3.6039 4.0667 4.1220 4.3157 3.7912 4.0048 3.9170 3.9017 4.1100 3.8019 3.7686 3.9104 3.9067 3.7166 3.9479 4.0611 3.9268 3.9766 1.0066 1.0142 1.0145 1.0373 0.9941 1.0270 1.0188 1.0457 1.0093 1.0208 1.0035 1.0328 0.9899 1.0013 1.0244 0.9973 0.9973 0.9952 1.0085 1.0288 0.9916 1.0293 1.0049 1.0193 1.0245 1.0168 1.0269 1.0167 1.0154 1.0330 1.0181 1.0155 1.0108 1.0182 1.0169 1.0016 1.0217 0.9929 0.9974
dispcorr: -0.055470606 hartree
energy: -2013.059570599782
dipole: 40.73624 -41.20012 -0.46388 9.25649 -10.31473 -1.05824 -8.62378 6.62912 -1.99466
magnitude: 2.30516 au
magnitude: 5.85924 debye
