program: Orca
programVersion: 5.0.2
elementType: O O O O O O O O O N C C C C C C C C C C C C C C C C C C C C C C C C C C C C C C C C C H H H H H H H H H H H H H H H H H H H H H H H H H H H H H H H H H H H H H H H
charge: 0
multiplicity: 1
keywords: wb97x-d3
keywords: def2-TZVPP
keywords: def2/J RIJCOSX
keywords: DEFGRID2
keywords: scfconv7
keywords: smallprint printgap noloewdin
keywords: NOSOSCF
formula: C33H39NO9
InChI: InChI=1/C33H39NO9/c1-31-11-10-24(42-29(38)18-8-9-18)32(2,16-40-28(37)17-6-7-17)22(31)14-23(35)33(3)27(31)26(36)25-21(43-33)13-20(41-30(25)39)19-5-4-12-34-15-19/h4-5,12-13,15,17-18,22-24,26-27,35-36H,6-11,14,16H2,1-3H3
82 atoms
O  -2.263395 0.003395 -1.361281
O  5.026826 0.912128 1.159567
O  -0.558141 0.017188 -3.597478
O  -1.711802 2.833008 1.144698
O  3.681605 -1.521025 -0.952419
O  -5.073987 0.143682 1.524909
O  5.381835 -1.151104 1.965741
O  -3.839219 1.360532 2.870146
O  3.301324 -2.274982 -3.029277
N  -8.036349 -2.866803 -0.56075
C  0.8933 1.588261 0.162976
C  1.792684 0.685226 -0.731857
C  -0.53269 0.962557 0.056286
C  3.327433 0.871209 -0.574619
C  -1.101279 0.883485 -1.37145
C  1.295885 0.716199 -2.176652
C  1.350435 1.437363 1.62346
C  -0.103571 0.129752 -2.266261
C  3.624597 0.700204 0.925667
C  2.84544 1.652249 1.809712
C  -1.570998 1.426191 1.087315
C  0.968394 3.074406 -0.233432
C  4.076534 -0.211722 -1.367469
C  3.871322 2.190944 -1.131875
C  -1.57055 2.194976 -1.984885
C  -2.883636 0.752389 0.797845
C  -3.128267 0.08322 -0.368645
C  5.787541 -0.04795 1.668178
C  -3.899738 0.798092 1.793151
C  7.194214 0.362239 1.839102
C  -4.367134 -0.591254 -0.580876
C  7.852211 1.287853 0.843807
C  7.544632 1.784498 2.204367
C  3.280185 -2.432501 -1.827742
C  2.812904 -3.675995 -1.186753
C  -5.299463 -0.536137 0.38845
C  3.390298 -4.143686 0.126601
C  2.00579 -3.620418 0.089952
C  -6.625947 -1.149816 0.339732
C  -7.692009 -0.651952 1.086805
C  -6.860347 -2.268298 -0.45955
C  -8.922481 -1.274677 0.984119
C  -9.046685 -2.371347 0.147693
H  1.600738 -0.33267 -0.366467
H  -0.378292 -0.087842 0.341764
H  1.30936 1.729495 -2.588219
H  1.931133 0.11895 -2.830779
H  1.098028 0.431802 1.978352
H  0.809585 2.138344 2.26315
H  -0.050969 -0.897842 -1.887344
H  3.35784 -0.318151 1.218015
H  3.126933 2.688456 1.608269
H  3.104821 1.459347 2.853411
H  -1.22509 1.062231 2.0619
H  1.151641 3.231245 -1.294168
H  1.776743 3.578363 0.293932
H  0.059815 3.609213 0.018442
H  5.151614 -0.129666 -1.193904
H  3.92232 -0.078606 -2.437393
H  3.485686 2.375719 -2.134868
H  3.619415 3.05365 -0.521043
H  4.959611 2.162227 -1.211751
H  -2.105576 2.009687 -2.916525
H  -0.737373 2.856196 -2.211391
H  -2.246422 2.733788 -1.324014
H  -0.437227 0.867126 -4.03707
H  -2.243475 3.041361 1.921132
H  7.814238 -0.416551 2.262914
H  -4.556914 -1.103384 -1.512748
H  7.259243 1.64675 0.012832
H  8.880708 1.061856 0.59714
H  8.358348 1.905035 2.906568
H  6.735508 2.491299 2.328224
H  2.539279 -4.442642 -1.899355
H  3.536415 -5.210958 0.223897
H  4.158764 -3.53995 0.590169
H  1.806557 -2.64881 0.523281
H  1.18441 -4.320568 0.160089
H  -7.576068 0.211713 1.727313
H  -6.051412 -2.711259 -1.02861
H  -9.775363 -0.914309 1.541641
H  -10.00054 -2.874543 0.047172
elementType: O N C H
totalener: -2013.00208214 hartree
nucrepener: 5482.26755571 hartree
electener: -7495.26963785 hartree
twoeener: 6161.34590083 hartree
cpcmener: -0.08230737 hartree
kineticenergy: 2004.19815627 hartree
xcener: -192.188219834508 hartree
chargesum: -0.0000000
charge: -0.323893 -0.307822 -0.450830 -0.424536 -0.286969 -0.234108 -0.510017 -0.519867 -0.504207 -0.373849 0.620062 -0.261707 -0.234924 0.432738 0.423843 -0.415725 -0.343043 0.212652 0.118818 -0.264399 0.118710 -0.459120 -0.123211 -0.410304 -0.378695 -0.289682 0.310320 0.445411 0.385902 -0.121497 -0.272812 -0.159916 -0.151337 0.438044 -0.106497 0.393216 -0.154863 -0.161345 -0.048167 -0.128568 0.009630 -0.157116 0.042603 0.077051 0.125838 0.119162 0.091078 0.108932 0.089646 0.101047 0.098545 0.094814 0.090811 0.118875 0.110089 0.112460 0.120206 0.128055 0.140628 0.120029 0.114661 0.110639 0.107367 0.127654 0.110286 0.235019 0.222542 0.104200 0.141046 0.099098 0.102940 0.102811 0.097516 0.102581 0.103776 0.094261 0.102426 0.105787 0.155583 0.130457 0.158959 0.150202
qa: -0.3239 -0.3078 -0.4508 -0.4245 -0.2870 -0.2341 -0.5100 -0.5199 -0.5042 -0.3738 0.6201 -0.2617 -0.2349 0.4327 0.4238 -0.4157 -0.3430 0.2127 0.1188 -0.2644 0.1187 -0.4591 -0.1232 -0.4103 -0.3787 -0.2897 0.3103 0.4454 0.3859 -0.1215 -0.2728 -0.1599 -0.1513 0.4380 -0.1065 0.3932 -0.1549 -0.1613 -0.0482 -0.1286 0.0096 -0.1571 0.0426 0.0771 0.1258 0.1192 0.0911 0.1089 0.0896 0.1010 0.0985 0.0948 0.0908 0.1189 0.1101 0.1125 0.1202 0.1281 0.1406 0.1200 0.1147 0.1106 0.1074 0.1277 0.1103 0.2350 0.2225 0.1042 0.1410 0.0991 0.1029 0.1028 0.0975 0.1026 0.1038 0.0943 0.1024 0.1058 0.1556 0.1305 0.1590 0.1502
va: 2.1849 2.1052 1.9985 1.9611 2.1045 2.2089 1.9870 1.9955 1.9963 3.0646 3.3442 4.0528 3.8903 3.5562 3.6457 4.0478 3.9501 3.8504 3.6900 4.0507 3.9852 3.9398 3.8109 3.9566 3.9451 3.6008 4.0632 4.1087 4.3172 3.8013 4.0119 3.9080 3.9072 4.1147 3.7969 3.7683 3.9161 3.9007 3.6884 3.9519 4.0642 3.9279 3.9774 1.0335 1.0112 1.0042 1.0513 0.9951 1.0273 1.0331 1.0452 1.0093 1.0210 1.0044 0.9907 1.0013 1.0333 1.0107 1.0098 0.9983 0.9962 1.0062 1.0241 0.9897 1.0300 1.0027 1.0198 1.0173 1.0178 1.0162 1.0159 1.0157 1.0201 1.0194 1.0173 1.0254 1.0120 1.0154 1.0121 1.0106 0.9934 0.9976
dispcorr: -0.055977620 hartree
energy: -2013.058059760157
dipole: 42.56541 -41.76806 0.79735 16.09871 -14.21868 1.88003 -3.95137 4.02143 0.07005
magnitude: 2.04333 au
magnitude: 5.19373 debye
