program: Orca
programVersion: 5.0.2
elementType: O O O O O O O O O N C C C C C C C C C C C C C C C C C C C C C C C C C C C C C C C C C H H H H H H H H H H H H H H H H H H H H H H H H H H H H H H H H H H H H H H H
charge: 0
multiplicity: 1
keywords: wb97x-d3
keywords: def2-TZVPP
keywords: def2/J RIJCOSX
keywords: DEFGRID2
keywords: scfconv7
keywords: smallprint printgap noloewdin
keywords: NOSOSCF
formula: C33H39NO9
InChI: InChI=1/C33H39NO9/c1-31-11-10-24(42-29(38)18-8-9-18)32(2,16-40-28(37)17-6-7-17)22(31)14-23(35)33(3)27(31)26(36)25-21(43-33)13-20(41-30(25)39)19-5-4-12-34-15-19/h4-5,12-13,15,17-18,22-24,26-27,35-36H,6-11,14,16H2,1-3H3
82 atoms
O  -2.390576 0.058882 -1.359898
O  4.944364 0.894146 1.070121
O  -0.702017 0.081924 -3.604612
O  -1.80416 2.830476 1.182537
O  3.568067 -1.469048 -1.035872
O  -5.159642 0.131004 1.568295
O  5.196384 -0.941883 2.330167
O  -3.906543 1.318902 2.922498
O  5.017045 -2.42993 -2.435574
N  -8.200439 -2.73808 -0.612244
C  0.794186 1.586636 0.165005
C  1.682675 0.695852 -0.751921
C  -0.636574 0.972021 0.061326
C  3.218981 0.89343 -0.61333
C  -1.217321 0.923805 -1.362756
C  1.172695 0.733433 -2.190973
C  1.266449 1.404787 1.617792
C  -0.236741 0.169661 -2.27542
C  3.536092 0.691034 0.877679
C  2.763704 1.615519 1.795977
C  -1.662259 1.424343 1.109922
C  0.871449 3.07914 -0.205223
C  3.977648 -0.159469 -1.43235
C  3.741413 2.232988 -1.146933
C  -1.673526 2.249991 -1.954248
C  -2.978084 0.754642 0.826115
C  -3.241005 0.117249 -0.353892
C  5.663446 0.022809 1.763066
C  -3.981379 0.779909 1.83492
C  7.103374 0.341469 1.774373
C  -4.48747 -0.542373 -0.568982
C  7.76857 0.903362 0.539598
C  7.583745 1.770514 1.725632
C  4.170571 -2.519414 -1.57216
C  3.71188 -3.801511 -1.006223
C  -5.406685 -0.509095 0.413624
C  3.43613 -3.91166 0.475988
C  2.306837 -3.958675 -0.480827
C  -6.743473 -1.099452 0.357029
C  -7.79194 -0.614633 1.13689
C  -7.009406 -2.174151 -0.491048
C  -9.037918 -1.201934 1.014002
C  -9.194628 -2.252052 0.12502
H  1.500663 -0.326327 -0.394389
H  -0.486865 -0.084412 0.326439
H  1.200807 1.745933 -2.604477
H  1.79615 0.121376 -2.844687
H  1.016637 0.392054 1.953335
H  0.732486 2.091771 2.278079
H  -0.199103 -0.862864 -1.910075
H  3.278806 -0.335561 1.148252
H  3.04279 2.657369 1.622891
H  3.032547 1.39219 2.831317
H  -1.305695 1.050639 2.076756
H  1.048281 3.253466 -1.26444
H  1.683365 3.572248 0.326765
H  -0.034508 3.610929 0.061889
H  5.052946 -0.049703 -1.27232
H  3.797773 -0.018929 -2.500125
H  4.825795 2.208109 -1.268866
H  3.318996 2.453387 -2.127324
H  3.515437 3.073764 -0.497186
H  -2.220853 2.083849 -2.882274
H  -0.83342 2.901898 -2.181432
H  -2.334758 2.789992 -1.279707
H  -0.58014 0.938162 -4.031166
H  -2.323802 3.030572 1.969039
H  7.68567 -0.349984 2.3688
H  -4.694101 -1.021425 -1.514735
H  7.153089 1.078646 -0.333101
H  8.759148 0.526958 0.323128
H  8.446261 2.000249 2.336404
H  6.841137 2.555744 1.68413
H  4.158339 -4.663106 -1.484584
H  3.751371 -4.831784 0.948987
H  3.571144 -3.026263 1.08293
H  1.639687 -3.109063 -0.542969
H  1.835799 -4.913294 -0.672157
H  -7.65026 0.214132 1.817131
H  -6.215564 -2.608828 -1.087132
H  -9.877946 -0.848878 1.595277
H  -10.161574 -2.72514 0.004936
elementType: O N C H
totalener: -2013.00344698 hartree
nucrepener: 5448.15837616 hartree
electener: -7461.16182314 hartree
twoeener: 6126.75107662 hartree
cpcmener: -0.08165653 hartree
kineticenergy: 2004.21377840 hartree
xcener: -192.190102515042 hartree
chargesum: -0.0000000
charge: -0.322431 -0.310957 -0.449633 -0.424324 -0.293343 -0.234679 -0.514477 -0.519256 -0.508923 -0.373573 0.642708 -0.322764 -0.224846 0.425755 0.413516 -0.385959 -0.353239 0.205173 0.093818 -0.240996 0.124485 -0.460100 -0.121104 -0.402657 -0.378403 -0.293251 0.310898 0.455874 0.387125 -0.115322 -0.273080 -0.158264 -0.149533 0.446781 -0.120474 0.391843 -0.155468 -0.151448 -0.047945 -0.127080 0.008851 -0.157727 0.042584 0.112132 0.124123 0.111782 0.093698 0.109705 0.090136 0.102618 0.099521 0.094239 0.089451 0.118677 0.109220 0.111867 0.120647 0.123687 0.139646 0.109875 0.119957 0.115507 0.107176 0.127591 0.110781 0.235044 0.222390 0.102246 0.140849 0.097039 0.103520 0.102676 0.096232 0.102207 0.104370 0.094445 0.097861 0.105494 0.155477 0.130419 0.159254 0.150291
qa: -0.3224 -0.3110 -0.4496 -0.4243 -0.2933 -0.2347 -0.5145 -0.5193 -0.5089 -0.3736 0.6427 -0.3228 -0.2248 0.4258 0.4135 -0.3860 -0.3532 0.2052 0.0938 -0.2410 0.1245 -0.4601 -0.1211 -0.4027 -0.3784 -0.2933 0.3109 0.4559 0.3871 -0.1153 -0.2731 -0.1583 -0.1495 0.4468 -0.1205 0.3918 -0.1555 -0.1514 -0.0479 -0.1271 0.0089 -0.1577 0.0426 0.1121 0.1241 0.1118 0.0937 0.1097 0.0901 0.1026 0.0995 0.0942 0.0895 0.1187 0.1092 0.1119 0.1206 0.1237 0.1396 0.1099 0.1200 0.1155 0.1072 0.1276 0.1108 0.2350 0.2224 0.1022 0.1408 0.0970 0.1035 0.1027 0.0962 0.1022 0.1044 0.0944 0.0979 0.1055 0.1555 0.1304 0.1593 0.1503
va: 2.1842 2.1041 1.9997 1.9619 2.0992 2.2085 1.9824 1.9962 1.9914 3.0645 3.2835 4.0427 3.8867 3.6540 3.6519 4.0698 3.9624 3.8770 3.7271 4.0328 3.9817 3.9402 3.7996 3.9500 3.9424 3.6023 4.0646 4.0904 4.3149 3.8073 4.0125 3.9093 3.9064 4.0914 3.8310 3.7709 3.9043 3.9046 3.6914 3.9511 4.0649 3.9285 3.9771 1.0052 1.0128 1.0012 1.0352 0.9937 1.0255 1.0320 1.0334 1.0096 1.0243 1.0044 0.9897 1.0021 1.0334 1.0161 0.9995 1.0055 0.9997 0.9958 1.0241 0.9894 1.0306 1.0029 1.0196 1.0187 1.0181 1.0154 1.0163 1.0161 1.0207 1.0192 1.0163 1.0218 1.0143 1.0160 1.0124 1.0108 0.9933 0.9976
dispcorr: -0.055033807 hartree
energy: -2013.058480790933
dipole: 41.14129 -41.17030 -0.02901 15.42057 -13.65216 1.76841 -6.19135 5.55479 -0.63656
magnitude: 1.87971 au
magnitude: 4.77785 debye
