program: Orca
programVersion: 5.0.2
elementType: O O O O O O O O O N C C C C C C C C C C C C C C C C C C C C C C C C C C C C C C C C C H H H H H H H H H H H H H H H H H H H H H H H H H H H H H H H H H H H H H H H
charge: 0
multiplicity: 1
keywords: wb97x-d3
keywords: def2-TZVPP
keywords: def2/J RIJCOSX
keywords: DEFGRID2
keywords: scfconv7
keywords: smallprint printgap noloewdin
keywords: NOSOSCF
formula: C33H39NO9
InChI: InChI=1/C33H39NO9/c1-31-11-10-24(42-29(38)18-8-9-18)32(2,16-40-28(37)17-6-7-17)22(31)14-23(35)33(3)27(31)26(36)25-21(43-33)13-20(41-30(25)39)19-5-4-12-34-15-19/h4-5,12-13,15,17-18,22-24,26-27,35-36H,6-11,14,16H2,1-3H3
82 atoms
O  -2.462321 0.022745 -1.397844
O  4.882516 1.149734 0.928577
O  -0.724282 0.078611 -3.681731
O  -1.907328 2.881936 1.061991
O  3.580835 -1.339812 -1.116005
O  -5.215711 0.156883 1.536842
O  5.33937 -0.91854 1.676144
O  -3.95624 1.366085 2.864746
O  5.625494 -2.148691 -1.533554
N  -8.539784 -2.194664 -0.868213
C  0.7021 1.672804 0.040165
C  1.604184 0.776534 -0.858861
C  -0.712917 1.018525 -0.026189
C  3.13466 1.028871 -0.750065
C  -1.305008 0.911634 -1.442769
C  1.075226 0.751256 -2.290723
C  1.199353 1.550937 1.490729
C  -0.314763 0.14288 -2.333317
C  3.480305 0.887902 0.743988
C  2.690824 1.820281 1.638839
C  -1.737932 1.477463 1.020401
C  0.729942 3.154458 -0.380438
C  3.923507 -0.021135 -1.545811
C  3.605344 2.367154 -1.332593
C  -1.794232 2.205127 -2.076545
C  -3.044611 0.778059 0.767574
C  -3.309672 0.102879 -0.390128
C  5.700884 0.189497 1.343121
C  -4.036618 0.808582 1.786975
C  7.106108 0.634968 1.330913
C  -4.543476 -0.589094 -0.572649
C  8.07344 -0.039641 2.267022
C  8.126063 -0.359493 0.822742
C  4.504062 -2.29135 -1.095323
C  4.026074 -3.546503 -0.487016
C  -5.46564 -0.525169 0.406978
C  3.063187 -3.517789 0.675032
C  2.591261 -3.988525 -0.64721
C  -6.79303 -1.142254 0.395443
C  -7.554832 -1.261452 1.557356
C  -7.348745 -1.624013 -0.79064
C  -8.801443 -1.855663 1.480252
C  -9.248849 -2.30851 0.251192
H  1.461734 -0.238295 -0.463655
H  -0.534652 -0.025353 0.269754
H  1.067681 1.749261 -2.736763
H  1.710271 0.136778 -2.930711
H  0.990856 0.539594 1.857164
H  0.650825 2.237151 2.139693
H  -0.241081 -0.871234 -1.912867
H  3.257553 -0.134507 1.057166
H  2.928394 2.864537 1.423783
H  2.982004 1.6450 2.677176
H  -1.364658 1.133881 1.992049
H  -0.195738 3.662771 -0.136698
H  0.906388 3.298392 -1.444149
H  1.520293 3.69454 0.138265
H  4.993068 0.152663 -1.422005
H  3.717592 0.063319 -2.614536
H  3.338259 3.222308 -0.718737
H  4.690748 2.383727 -1.44443
H  3.184068 2.53231 -2.32455
H  -2.341507 1.995371 -2.994764
H  -0.969955 2.865201 -2.333978
H  -2.460704 2.753466 -1.413487
H  -1.532923 -0.44187 -3.736702
H  -2.409326 3.091183 1.85756
H  7.274907 1.677502 1.096209
H  -4.719427 -1.143959 -1.482189
H  7.675501 -0.78328 2.944876
H  8.848795 0.586827 2.686228
H  8.933174 0.04743 0.229013
H  7.759603 -1.322022 0.490642
H  4.777198 -4.325296 -0.478163
H  3.238477 -4.249145 1.452335
H  2.724153 -2.554541 1.032414
H  1.923513 -3.354778 -1.215339
H  2.437769 -5.048957 -0.794738
H  -7.187979 -0.907334 2.510686
H  -6.811739 -1.532554 -1.726881
H  -9.417851 -1.968118 2.360875
H  -10.220055 -2.779854 0.162749
elementType: O N C H
totalener: -2013.00413728 hartree
nucrepener: 5451.65689624 hartree
electener: -7464.66103352 hartree
twoeener: 6131.06303483 hartree
cpcmener: -0.07688655 hartree
kineticenergy: 2004.19706442 hartree
xcener: -192.188521002506 hartree
chargesum: 0.0000000
charge: -0.336074 -0.325125 -0.435120 -0.424316 -0.280791 -0.233079 -0.506164 -0.520353 -0.505064 -0.373126 0.617584 -0.290080 -0.219304 0.404121 0.475500 -0.290069 -0.352568 0.060047 0.163578 -0.276159 0.132046 -0.459635 -0.109840 -0.410722 -0.377833 -0.290267 0.303471 0.422367 0.381921 -0.114603 -0.256038 -0.145869 -0.157498 0.412083 -0.092492 0.376863 -0.167140 -0.152047 -0.044242 -0.125061 0.011391 -0.157651 0.043774 0.107057 0.123987 0.099682 0.093962 0.109824 0.089969 0.114128 0.094321 0.095197 0.091079 0.118616 0.120293 0.109220 0.112389 0.119753 0.143415 0.115975 0.109211 0.120984 0.104112 0.121869 0.113561 0.233243 0.222675 0.103129 0.138828 0.091033 0.105077 0.104663 0.091446 0.103060 0.105661 0.102467 0.097219 0.104526 0.154864 0.127313 0.158823 0.150957
qa: -0.3361 -0.3251 -0.4351 -0.4243 -0.2808 -0.2331 -0.5062 -0.5204 -0.5051 -0.3731 0.6176 -0.2901 -0.2193 0.4041 0.4755 -0.2901 -0.3526 0.0600 0.1636 -0.2762 0.1320 -0.4596 -0.1098 -0.4107 -0.3778 -0.2903 0.3035 0.4224 0.3819 -0.1146 -0.2560 -0.1459 -0.1575 0.4121 -0.0925 0.3769 -0.1671 -0.1520 -0.0442 -0.1251 0.0114 -0.1577 0.0438 0.1071 0.1240 0.0997 0.0940 0.1098 0.0900 0.1141 0.0943 0.0952 0.0911 0.1186 0.1203 0.1092 0.1124 0.1198 0.1434 0.1160 0.1092 0.1210 0.1041 0.1219 0.1136 0.2332 0.2227 0.1031 0.1388 0.0910 0.1051 0.1047 0.0914 0.1031 0.1057 0.1025 0.0972 0.1045 0.1549 0.1273 0.1588 0.1510
va: 2.1693 2.1189 2.0121 1.9635 2.0958 2.2099 1.9889 1.9948 1.9836 3.0631 3.3208 4.0484 3.8598 3.6364 3.5823 3.8882 3.9396 4.0229 3.6395 4.0550 3.9842 3.9424 3.7817 3.9519 3.9483 3.6031 4.0851 4.1252 4.3162 3.7897 4.0387 3.9172 3.9018 4.1097 3.8018 3.7951 3.9107 3.9059 3.6894 3.9529 4.0629 3.9259 3.9744 1.0072 1.0153 1.0146 1.0376 0.9944 1.0271 1.0181 1.0438 1.0096 1.0207 1.0034 1.0324 0.9897 1.0013 1.0242 0.9967 0.9952 1.0084 0.9976 1.0289 0.9911 1.0287 1.0049 1.0194 1.0243 1.0200 1.0267 1.0166 1.0154 1.0331 1.0182 1.0156 1.0111 1.0183 1.0169 1.0149 1.0144 0.9937 0.9973
dispcorr: -0.055389960 hartree
energy: -2013.059527237627
dipole: 40.11844 -41.10362 -0.98519 10.58887 -10.72168 -0.13282 -5.53325 5.38281 -0.15044
magnitude: 1.00542 au
magnitude: 2.55557 debye
