program: Orca
programVersion: 5.0.2
elementType: O O O O O O O O O N C C C C C C C C C C C C C C C C C C C C C C C C C C C C C C C C C H H H H H H H H H H H H H H H H H H H H H H H H H H H H H H H H H H H H H H H
charge: 0
multiplicity: 1
keywords: wb97x-d3
keywords: def2-TZVPP
keywords: def2/J RIJCOSX
keywords: DEFGRID2
keywords: scfconv7
keywords: smallprint printgap noloewdin
keywords: NOSOSCF
formula: C33H39NO9
InChI: InChI=1/C33H39NO9/c1-31-11-10-24(42-29(38)18-8-9-18)32(2,16-40-28(37)17-6-7-17)22(31)14-23(35)33(3)27(31)26(36)25-21(43-33)13-20(41-30(25)39)19-5-4-12-34-15-19/h4-5,12-13,15,17-18,22-24,26-27,35-36H,6-11,14,16H2,1-3H3
82 atoms
O  -2.312765 0.053964 -1.421562
O  5.039151 1.069145 0.85878
O  -0.611092 0.277978 -3.737135
O  -1.758825 2.823638 1.131374
O  3.739247 -1.387084 -1.122056
O  -5.036748 0.043365 1.545176
O  5.339252 -0.702127 2.202352
O  -3.78085 1.225861 2.900447
O  2.905881 -2.152831 -3.059499
N  -8.519065 -2.033272 1.579372
C  0.856806 1.65551 0.052838
C  1.74186 0.795943 -0.898963
C  -0.561529 1.009165 -0.030609
C  3.277833 1.001114 -0.786661
C  -1.16999 0.962211 -1.44342
C  1.199386 0.875216 -2.325142
C  1.364621 1.470305 1.492087
C  -0.184947 0.257455 -2.392643
C  3.631913 0.821935 0.699231
C  2.857337 1.728749 1.632817
C  -1.578762 1.422903 1.041883
C  0.894397 3.154936 -0.293385
C  4.024676 -0.071039 -1.601047
C  3.777151 2.33428 -1.353804
C  -1.688809 2.278552 -2.002875
C  -2.881369 0.719946 0.776779
C  -3.14972 0.084115 -0.402426
C  5.773722 0.267555 1.618967
C  -3.864468 0.704125 1.805277
C  7.1808 0.707593 1.662833
C  -4.374962 -0.620114 -0.59547
C  7.935579 0.504881 2.953702
C  8.244441 -0.354732 1.789269
C  3.146208 -2.29935 -1.880776
C  2.810961 -3.526479 -1.133871
C  -5.286528 -0.605133 0.395581
C  3.640394 -3.974929 0.043253
C  2.283386 -3.431084 0.279487
C  -6.600608 -1.249528 0.370262
C  -7.174527 -1.681871 -0.824703
C  -7.327864 -1.452211 1.54415
C  -8.413585 -2.290507 -0.791892
C  -9.046379 -2.443121 0.431601
H  1.575873 -0.236794 -0.561471
H  -0.381635 -0.046274 0.219518
H  1.173735 1.904876 -2.688785
H  1.830818 0.325451 -3.022895
H  1.155943 0.44571 1.820342
H  0.823939 2.132036 2.172468
H  -0.096371 -0.781228 -2.040483
H  3.410633 -0.209501 0.983141
H  3.101068 2.777197 1.447742
H  3.159484 1.519508 2.662025
H  -1.193229 1.049842 1.997753
H  1.7391 3.646404 0.185658
H  0.005385 3.669217 0.054003
H  0.989527 3.356125 -1.358083
H  5.101341 0.065849 -1.491713
H  3.801084 0.018339 -2.66314
H  3.350859 2.522552 -2.339322
H  3.531157 3.185019 -0.724339
H  4.86128 2.328799 -1.475393
H  -2.245382 2.107339 -2.922987
H  -0.879147 2.964817 -2.236576
H  -2.35468 2.782197 -1.305621
H  -1.412652 -0.249946 -3.817309
H  -2.262767 3.002174 1.932916
H  7.421984 1.586252 1.07937
H  -4.553477 -1.147168 -1.521033
H  7.393645 0.072608 3.78447
H  8.635559 1.28337 3.224615
H  9.161763 -0.17978 1.244005
H  7.918894 -1.386437 1.809098
H  2.387473 -4.301739 -1.758467
H  3.790308 -5.042136 0.134352
H  4.494325 -3.374427 0.326661
H  2.188416 -2.446827 0.719295
H  1.486634 -4.116385 0.534424
H  -6.673638 -1.535811 -1.772263
H  -6.931069 -1.140785 2.501859
H  -8.888551 -2.634583 -1.699644
H  -10.021243 -2.912195 0.486448
elementType: O N C H
totalener: -2013.00327124 hartree
nucrepener: 5464.38214905 hartree
electener: -7477.38542029 hartree
twoeener: 6143.61531139 hartree
cpcmener: -0.07881262 hartree
kineticenergy: 2004.20216699 hartree
xcener: -192.188945948736 hartree
chargesum: 0.0000000
charge: -0.336070 -0.325917 -0.435357 -0.424147 -0.287918 -0.234980 -0.520337 -0.519937 -0.503252 -0.373791 0.605981 -0.256615 -0.224327 0.444702 0.477900 -0.326032 -0.361092 0.067629 0.111729 -0.235145 0.130217 -0.459269 -0.122672 -0.406364 -0.377684 -0.291813 0.310900 0.469720 0.382584 -0.138305 -0.264332 -0.151124 -0.152026 0.432581 -0.104768 0.376649 -0.150940 -0.158077 -0.039318 -0.113038 0.002660 -0.164247 0.044849 0.078112 0.126347 0.108218 0.096541 0.110070 0.089905 0.109465 0.091467 0.092414 0.091227 0.118899 0.112859 0.122130 0.109997 0.124637 0.137595 0.120530 0.115912 0.108196 0.103933 0.121682 0.113611 0.232921 0.222018 0.103457 0.139232 0.094864 0.104637 0.104219 0.094280 0.103295 0.104442 0.093742 0.099447 0.106217 0.152365 0.132391 0.159314 0.150205
qa: -0.3361 -0.3259 -0.4354 -0.4241 -0.2879 -0.2350 -0.5203 -0.5199 -0.5033 -0.3738 0.6060 -0.2566 -0.2243 0.4447 0.4779 -0.3260 -0.3611 0.0676 0.1117 -0.2351 0.1302 -0.4593 -0.1227 -0.4064 -0.3777 -0.2918 0.3109 0.4697 0.3826 -0.1383 -0.2643 -0.1511 -0.1520 0.4326 -0.1048 0.3766 -0.1509 -0.1581 -0.0393 -0.1130 0.0027 -0.1642 0.0448 0.0781 0.1263 0.1082 0.0965 0.1101 0.0899 0.1095 0.0915 0.0924 0.0912 0.1189 0.1129 0.1221 0.1100 0.1246 0.1376 0.1205 0.1159 0.1082 0.1039 0.1217 0.1136 0.2329 0.2220 0.1035 0.1392 0.0949 0.1046 0.1042 0.0943 0.1033 0.1044 0.0937 0.0994 0.1062 0.1524 0.1324 0.1593 0.1502
va: 2.1704 2.1289 2.0123 1.9629 2.0957 2.2067 1.9764 1.9953 1.9956 3.0595 3.3718 4.0415 3.8667 3.5809 3.5901 3.8711 3.9692 3.9989 3.6778 4.0264 3.9894 3.9318 3.8295 3.9571 3.9467 3.5995 4.0721 4.0678 4.3170 3.8242 4.0314 3.9055 3.9010 4.1193 3.7930 3.7966 3.9160 3.9030 3.7362 3.9405 4.0650 3.9232 3.9743 1.0302 1.0119 1.0179 1.0479 0.9937 1.0258 1.0211 1.0487 1.0106 1.0231 1.0041 1.0020 1.0351 0.9914 1.0150 1.0107 0.9960 0.9958 1.0093 1.0288 0.9925 1.0301 1.0047 1.0199 1.0230 1.0194 1.0256 1.0165 1.0167 1.0253 1.0196 1.0166 1.0240 1.0099 1.0157 1.0041 1.0246 0.9929 0.9972
dispcorr: -0.055110647 hartree
energy: -2013.058381887990
dipole: 43.71619 -42.87681 0.83938 11.09139 -11.54606 -0.45467 -5.87515 4.18325 -1.69190
magnitude: 1.94263 au
magnitude: 4.93778 debye
