program: Orca
programVersion: 5.0.2
elementType: O O O O O O O O O N C C C C C C C C C C C C C C C C C C C C C C C C C C C C C C C C C H H H H H H H H H H H H H H H H H H H H H H H H H H H H H H H H H H H H H H H
charge: 0
multiplicity: 1
keywords: wb97x-d3
keywords: def2-TZVPP
keywords: def2/J RIJCOSX
keywords: DEFGRID2
keywords: scfconv7
keywords: smallprint printgap noloewdin
keywords: NOSOSCF
formula: C33H39NO9
InChI: InChI=1/C33H39NO9/c1-31-11-10-24(42-29(38)18-8-9-18)32(2,16-40-28(37)17-6-7-17)22(31)14-23(35)33(3)27(31)26(36)25-21(43-33)13-20(41-30(25)39)19-5-4-12-34-15-19/h4-5,12-13,15,17-18,22-24,26-27,35-36H,6-11,14,16H2,1-3H3
82 atoms
O  -2.247187 -0.092478 -1.362899
O  5.076203 1.200218 0.937669
O  -0.598302 -0.112754 -3.594506
O  -1.745786 2.901723 0.921536
O  3.736643 -1.464107 -0.909164
O  -5.004867 0.144835 1.568368
O  5.306729 -0.110141 2.741936
O  -3.781141 1.481771 2.804985
O  3.123546 -2.296578 -2.901804
N  -7.974751 -2.986544 -0.310893
C  0.895421 1.657999 0.022828
C  1.807457 0.722362 -0.82373
C  -0.518136 0.995439 -0.03193
C  3.338999 0.951622 -0.704036
C  -1.10196 0.805974 -1.446451
C  1.286148 0.654261 -2.257727
C  1.374662 1.604077 1.482607
C  -0.094524 0.015481 -2.286197
C  3.676428 0.906545 0.797178
C  2.864468 1.87816 1.632526
C  -1.556606 1.502757 0.976505
C  0.932158 3.119781 -0.456964
C  4.101752 -0.178964 -1.419563
C  3.839294 2.236014 -1.374764
C  -1.603569 2.064117 -2.141518
C  -2.848211 0.765898 0.760161
C  -3.094718 0.025222 -0.36046
C  5.769478 0.658366 1.930903
C  -3.847842 0.84983 1.771946
C  7.173286 1.116554 1.917879
C  -4.324484 -0.684183 -0.51046
C  7.85739 1.304605 3.249889
C  8.230822 0.153824 2.397142
C  3.233221 -2.402727 -1.702851
C  2.818794 -3.589415 -0.927721
C  -5.238482 -0.593826 0.473939
C  1.519478 -4.250549 -1.327862
C  2.803672 -4.92465 -1.624081
C  -6.560227 -1.220713 0.476419
C  -7.624041 -0.678823 1.195897
C  -6.797588 -2.38729 -0.251122
C  -8.855857 -1.304493 1.13469
C  -8.984189 -2.449621 0.364934
H  1.645059 -0.273574 -0.38879
H  -0.336958 -0.030152 0.320058
H  1.254319 1.640603 -2.726433
H  1.934672 0.045884 -2.889521
H  1.158648 0.61345 1.898728
H  0.821994 2.32422 2.090709
H  -0.003466 -0.977025 -1.816125
H  3.481237 -0.105417 1.16407
H  3.106358 2.908605 1.361564
H  3.138982 1.766779 2.684214
H  -1.186004 1.22758 1.971168
H  1.759907 3.659592 -0.000403
H  0.029839 3.655058 -0.182753
H  1.058654 3.223314 -1.532574
H  5.173915 -0.069035 -1.247095
H  3.947138 -0.127346 -2.496789
H  3.404151 2.353543 -2.367193
H  3.607593 3.135413 -0.810425
H  4.921971 2.214914 -1.507392
H  -0.787276 2.731241 -2.406781
H  -2.290649 2.624374 -1.509804
H  -2.129773 1.810805 -3.060881
H  -0.001137 -0.684477 -4.088425
H  -2.273866 3.157763 1.685856
H  7.44452 1.797038 1.121199
H  -4.523774 -1.244461 -1.412183
H  7.272971 1.117102 4.141348
H  8.540935 2.139907 3.324028
H  9.177023 0.181954 1.873443
H  7.906893 -0.834812 2.695516
H  3.059052 -3.577228 0.127289
H  0.906836 -4.628423 -0.52042
H  0.966583 -3.811367 -2.148084
H  3.142244 -4.955657 -2.651441
H  3.089345 -5.780389 -1.027265
H  -7.505276 0.222846 1.781763
H  -5.989965 -2.866221 -0.793858
H  -9.706856 -0.908816 1.671512
H  -9.939296 -2.95727 0.294643
elementType: O N C H
totalener: -2013.01149785 hartree
nucrepener: 5426.43775353 hartree
electener: -7439.44925138 hartree
twoeener: 6106.13138056 hartree
cpcmener: -0.06032917 hartree
kineticenergy: 2004.22089470 hartree
xcener: -192.185617920455 hartree
chargesum: -0.0000000
charge: -0.316962 -0.314665 -0.402170 -0.405514 -0.300130 -0.231754 -0.486884 -0.485329 -0.476611 -0.365132 0.635748 -0.300407 -0.254086 0.441763 0.535725 -0.360358 -0.359399 0.045970 0.099097 -0.246337 0.123255 -0.456956 -0.112916 -0.407422 -0.376435 -0.298341 0.301254 0.435756 0.368685 -0.127014 -0.271067 -0.152482 -0.150997 0.409540 -0.092292 0.386364 -0.164453 -0.147120 -0.044472 -0.126872 0.005736 -0.155218 0.041422 0.105127 0.122578 0.106199 0.100124 0.108662 0.089231 0.097459 0.099392 0.091070 0.093329 0.115919 0.112600 0.123429 0.107038 0.125223 0.134451 0.117246 0.112148 0.108191 0.118847 0.113848 0.107182 0.219284 0.214644 0.100589 0.138674 0.095163 0.102022 0.101956 0.093652 0.103749 0.103821 0.096641 0.091149 0.104002 0.153665 0.128315 0.155372 0.147489
qa: -0.3170 -0.3147 -0.4022 -0.4055 -0.3001 -0.2318 -0.4869 -0.4853 -0.4766 -0.3651 0.6357 -0.3004 -0.2541 0.4418 0.5357 -0.3604 -0.3594 0.0460 0.0991 -0.2463 0.1233 -0.4570 -0.1129 -0.4074 -0.3764 -0.2983 0.3013 0.4358 0.3687 -0.1270 -0.2711 -0.1525 -0.1510 0.4095 -0.0923 0.3864 -0.1645 -0.1471 -0.0445 -0.1269 0.0057 -0.1552 0.0414 0.1051 0.1226 0.1062 0.1001 0.1087 0.0892 0.0975 0.0994 0.0911 0.0933 0.1159 0.1126 0.1234 0.1070 0.1252 0.1345 0.1172 0.1121 0.1082 0.1188 0.1138 0.1072 0.2193 0.2146 0.1006 0.1387 0.0952 0.1020 0.1020 0.0937 0.1037 0.1038 0.0966 0.0911 0.1040 0.1537 0.1283 0.1554 0.1475
va: 2.2041 2.1336 2.0466 1.9830 2.1166 2.2088 2.0212 2.0400 2.0312 3.0704 3.3021 4.0352 3.9347 3.5975 3.6216 3.9432 3.9735 4.0470 3.6925 4.0032 3.9989 3.9276 3.8114 3.9648 3.9416 3.5773 4.0715 4.1074 4.3411 3.8213 4.0070 3.9067 3.9018 4.1368 3.7852 3.7725 3.9066 3.9223 3.6871 3.9538 4.0681 3.9276 3.9803 1.0180 1.0156 1.0173 1.0413 0.9940 1.0243 1.0295 1.0468 1.0121 1.0290 1.0040 1.0016 1.0362 0.9917 1.0147 1.0115 0.9970 0.9978 1.0086 0.9937 1.0293 1.0267 1.0150 1.0269 1.0220 1.0184 1.0259 1.0167 1.0168 1.0263 1.0207 1.0159 1.0222 1.0273 1.0165 1.0127 1.0104 0.9944 0.9978
dispcorr: -0.053435595 hartree
energy: -2013.064933447070
dipole: 42.40025 -41.11307 1.28719 10.85197 -10.75422 0.09776 -7.09163 6.50004 -0.59159
magnitude: 1.42000 au
magnitude: 3.60935 debye
