program: Gaussian 09
title: 000006592
version: EM64L-G09RevD.01
frameworkgroup: C1[X(C2Cl2F2)]
method: RPBEPBE
basis: SDD
operation: Freq
keyword: #pfreq=noraman
keyword: PBEPBE/SDD
title: #p freq=noraman PBEPBE/SDD
converged: NO NO NO NO
title: Mulliken charges:
elementType: Cl Cl F F C C
charge: 0.085685 0.085728 -0.141293 -0.141259 -0.420336 0.531475
chargesum: 0.00000
title: Mulliken charges with hydrogens summed into heavy atoms:
polarizability: 4.93434255e+01 7.63324710e-05 5.26012809e+01 -3.70669332e-04 3.91924977e-04 1.53520995e+01
1716.lowfreq: -12.5081 -10.9152 -7.2252 0.0012 0.0038 0.0039 135.3764 168.0447 240.4956
frequency: 135.3588 168.0428 240.4956 300.5734 386.1699 418.8473 508.9835 554.3173 878.3624 941.3301 1185.1367 1713.5220
redmass: 21.2313 23.1791 25.8943 13.1488 25.4955 20.5837 12.3192 18.4532 13.0789 14.4756 13.2601 12.1151
irintensity: 0.0000 3.4666 0.1209 0.1156 0.7388 1.7302 8.9094 4.8883 142.4510 148.5581 126.3903 82.5501
temp: 298.150 k
press: 1.00000 atm
elementType: 17 17 9 9 6 6
symmnumber: 1
zpe: 44448.1 jmol-1
zpe.correction: 0.016929 hartree
zpe.thermalcorrener: 0.023107 hartree
zpe.thermalcorrenthalpy: 0.024051 hartree
zpe.thermalcorrgfe: -0.014417 hartree
zpe.sumelectzpe: -1195.499434 hartree
zpe.sumelectthermal: -1195.493257 hartree
zpe.sumelectthermalent: -1195.492312 hartree
zpe.sumelectthermalfe: -1195.530780 hartree
dipole: -0.5465 0.0001 0.0000
dipole: 0.5465
quadrupole: -48.1666 -46.5714 -45.7836
quadrupole: -0.0006 0.0001 0.0000
quadrupole: -1.3260 0.2692 1.0569 -0.0006 0.0001 0.0000
hfenergy: -1195.5163631 hartree
pointgroup: C01 [X(C2Cl2F2)]
dipole: 0.2150189 -0.0000403 -0.0000141 debye
dipolederiv: -0.179127 -0.2047103 0.0000053 -0.2091436 -0.5334475 0.0000085 0.000031 0.0000316 0.0582478 -0.1790681 0.2046764 0.0000014 0.2091223 -0.5334719 0.000003 0.0000269 -0.0000196 0.0582907 -0.6572204 -0.2867239 -0.0000101 -0.4814828 -0.6017095 -0.0000072 -0.0000098 -0.0000048 -0.0793806 -0.6571476 0.2867312 -0.0000183 0.481524 -0.6018021 0.0000227 -0.0000237 0.0000198 -0.0793468 0.2766959 0.0000431 -0.0000205 0.0000411 1.2084759 -0.0000128 -0.0000751 -0.0000141 -0.2031201 1.3958671 -0.0000166 0.0000422 -0.0000611 1.0619552 -0.0000141 0.0000507 -0.000013 0.2453091 unknown
polarizability: 49.3434255|0.0002293|52.6012808|0.0003707|-0.0003919|15.3520995 unknown
InChI: InChI=1S/C2Cl2F2/c3-1(4)2(5)6
charge 0 multiplicity 1
6 atoms
Cl 1.549504 1.529898 -0.000036
Cl 1.549332 -1.530061 -0.000006
F  -1.499937 -1.135264 -0.000024
F  -1.499803 1.13543 -0.000057
C  0.626117 -0.000065 0.000037
C  -0.725212 0.000063 -0.000016
