program: Orca
programVersion: 5.0.2
elementType: O O O O O O O O O N C C C C C C C C C C C C C C C C C C C C C C C C C C C C C C C C C H H H H H H H H H H H H H H H H H H H H H H H H H H H H H H H H H H H H H H H
charge: 0
multiplicity: 1
keywords: wb97x-d3
keywords: def2-TZVPP
keywords: def2/J RIJCOSX
keywords: DEFGRID2
keywords: scfconv7
keywords: smallprint printgap noloewdin
keywords: NOSOSCF
formula: C33H39NO9
InChI: InChI=1/C33H39NO9/c1-31-11-10-24(42-29(38)18-8-9-18)32(2,16-40-28(37)17-6-7-17)22(31)14-23(35)33(3)27(31)26(36)25-21(43-33)13-20(41-30(25)39)19-5-4-12-34-15-19/h4-5,12-13,15,17-18,22-24,26-27,35-36H,6-11,14,16H2,1-3H3
82 atoms
O  -2.457912 0.101606 -1.440927
O  4.929456 0.777358 0.853086
O  -0.74574 0.308531 -3.755182
O  -1.788188 2.798572 1.154048
O  3.604053 -1.525096 -1.219072
O  -5.169348 0.139539 1.537146
O  5.062747 -0.967374 2.252376
O  -3.869654 1.265092 2.89895
O  5.754909 -2.082955 -0.911027
N  -8.584013 -2.001762 -0.922137
C  0.770662 1.561672 0.049491
C  1.630991 0.687826 -0.914027
C  -0.667247 0.962516 -0.038253
C  3.17385 0.860077 -0.799573
C  -1.280705 0.965092 -1.449496
C  1.087778 0.788875 -2.338298
C  1.274955 1.349694 1.486974
C  -0.32593 0.238863 -2.413442
C  3.513303 0.629708 0.681809
C  2.776816 1.553365 1.629764
C  -1.66602 1.395875 1.044142
C  0.844301 3.064549 -0.278944
C  3.911605 -0.195344 -1.642004
C  3.698073 2.199761 -1.328441
C  -1.749567 2.309332 -1.986373
C  -2.994624 0.748073 0.770056
C  -3.289498 0.144508 -0.418485
C  5.590502 -0.075257 1.628864
C  -3.976648 0.758744 1.802617
C  7.044649 0.176009 1.65459
C  -4.541214 -0.512336 -0.616525
C  7.77088 0.572729 0.391849
C  7.60457 1.565508 1.479058
C  4.577591 -2.346098 -0.831567
C  4.073855 -3.623845 -0.292054
C  -5.446701 -0.47894 0.380345
C  2.847005 -3.647729 0.588502
C  2.7781 -4.22653 -0.773719
C  -6.783409 -1.0755 0.360265
C  -7.506749 -1.286059 1.533666
C  -7.387512 -1.445945 -0.842785
C  -8.760744 -1.864049 1.452057
C  -9.254609 -2.210792 0.205319
H  1.44632 -0.345958 -0.590547
H  -0.52234 -0.102972 0.192152
H  1.113608 1.81681 -2.70816
H  1.69139 0.201546 -3.032162
H  1.032663 0.3309 1.810914
H  0.756903 2.024673 2.172216
H  -0.285288 -0.809591 -2.080792
H  3.227031 -0.393204 0.939837
H  3.059569 2.594938 1.459913
H  3.07049 1.319129 2.656191
H  -1.294597 0.990386 1.992991
H  -0.048472 3.588342 0.044103
H  0.980426 3.275301 -1.337589
H  1.677816 3.538977 0.236494
H  4.985726 -0.022206 -1.590552
H  3.633217 -0.117723 -2.693705
H  3.42358 3.045597 -0.70505
H  4.787145 2.196915 -1.398164
H  3.319799 2.398503 -2.332082
H  -0.915255 2.968413 -2.213126
H  -2.393206 2.828213 -1.278658
H  -2.314105 2.173911 -2.908179
H  -1.564052 -0.188587 -3.856786
H  -2.299936 2.989268 1.947919
H  7.573201 -0.483098 2.330985
H  -4.741035 -1.021692 -1.547927
H  7.190237 0.693159 -0.51301
H  8.743856 0.12344 0.242792
H  8.462718 1.812325 2.09018
H  6.908141 2.380705 1.334399
H  4.867826 -4.312355 -0.033712
H  2.884787 -4.319149 1.43597
H  2.339538 -2.711528 0.781261
H  2.220367 -3.697207 -1.534726
H  2.76603 -5.303515 -0.877454
H  -7.102479 -1.015339 2.499674
H  -6.886274 -1.270658 -1.788001
H  -9.34669 -2.046252 2.342296
H  -10.231469 -2.670948 0.11043
elementType: O N C H
totalener: -2013.00915099 hartree
nucrepener: 5471.20350847 hartree
electener: -7484.21265947 hartree
twoeener: 6150.54452851 hartree
cpcmener: -0.06274955 hartree
kineticenergy: 2004.20885358 hartree
xcener: -192.187150618167 hartree
chargesum: -0.0000000
charge: -0.330211 -0.302235 -0.409771 -0.403960 -0.291672 -0.230975 -0.472361 -0.484427 -0.463589 -0.364400 0.618315 -0.292750 -0.220571 0.408220 0.465167 -0.281056 -0.364322 0.049151 0.122708 -0.253472 0.127066 -0.466932 -0.109152 -0.402605 -0.372296 -0.293369 0.298635 0.388188 0.364034 -0.097967 -0.260636 -0.168143 -0.150052 0.398370 -0.090520 0.374574 -0.160393 -0.151132 -0.042291 -0.127885 0.008803 -0.153882 0.041786 0.104529 0.121865 0.097448 0.092181 0.109094 0.092416 0.108278 0.084723 0.093489 0.091260 0.115557 0.125037 0.109430 0.109937 0.123288 0.135989 0.116375 0.107911 0.121647 0.119123 0.114169 0.102090 0.222192 0.212965 0.101007 0.136102 0.097366 0.102290 0.100779 0.094420 0.102358 0.103489 0.098717 0.094948 0.102255 0.154240 0.124682 0.155955 0.148407
qa: -0.3302 -0.3022 -0.4098 -0.4040 -0.2917 -0.2310 -0.4724 -0.4844 -0.4636 -0.3644 0.6183 -0.2928 -0.2206 0.4082 0.4652 -0.2811 -0.3643 0.0492 0.1227 -0.2535 0.1271 -0.4669 -0.1092 -0.4026 -0.3723 -0.2934 0.2986 0.3882 0.3640 -0.0980 -0.2606 -0.1681 -0.1501 0.3984 -0.0905 0.3746 -0.1604 -0.1511 -0.0423 -0.1279 0.0088 -0.1539 0.0418 0.1045 0.1219 0.0974 0.0922 0.1091 0.0924 0.1083 0.0847 0.0935 0.0913 0.1156 0.1250 0.1094 0.1099 0.1233 0.1360 0.1164 0.1079 0.1216 0.1191 0.1142 0.1021 0.2222 0.2130 0.1010 0.1361 0.0974 0.1023 0.1008 0.0944 0.1024 0.1035 0.0987 0.0949 0.1023 0.1542 0.1247 0.1560 0.1484
va: 2.1759 2.1071 2.0414 1.9856 2.0991 2.2100 2.0254 2.0406 2.0391 3.0692 3.3031 4.0532 3.8725 3.6261 3.6089 3.8842 3.9597 4.0511 3.6709 4.0436 4.0097 3.9451 3.8179 3.9538 3.9434 3.5867 4.0834 4.1737 4.3411 3.7898 4.0376 3.9166 3.9056 4.1561 3.7920 3.7982 3.9095 3.9091 3.6879 3.9569 4.0673 3.9256 3.9788 1.0066 1.0147 1.0143 1.0399 0.9937 1.0256 1.0155 1.0504 1.0097 1.0248 1.0033 1.0341 0.9900 1.0024 1.0290 1.0038 0.9950 1.0070 0.9970 0.9934 1.0303 1.0300 1.0138 1.0284 1.0186 1.0200 1.0159 1.0159 1.0167 1.0219 1.0193 1.0157 1.0111 1.0214 1.0163 1.0148 1.0132 0.9944 0.9976
dispcorr: -0.056251861 hartree
energy: -2013.065402852929
dipole: 39.67008 -40.56309 -0.89302 12.17949 -12.43527 -0.25578 -8.02804 7.08391 -0.94413
magnitude: 1.32449 au
magnitude: 3.36659 debye
