program: Orca
programVersion: 5.0.2
elementType: O O O O O O O O O N C C C C C C C C C C C C C C C C C C C C C C C C C C C C C C C C C H H H H H H H H H H H H H H H H H H H H H H H H H H H H H H H H H H H H H H H
charge: 0
multiplicity: 1
keywords: wb97x-d3
keywords: def2-TZVPP
keywords: def2/J RIJCOSX
keywords: DEFGRID2
keywords: scfconv7
keywords: smallprint printgap noloewdin
keywords: NOSOSCF
formula: C33H39NO9
InChI: InChI=1/C33H39NO9/c1-31-11-10-24(42-29(38)18-8-9-18)32(2,16-40-28(37)17-6-7-17)22(31)14-23(35)33(3)27(31)26(36)25-21(43-33)13-20(41-30(25)39)19-5-4-12-34-15-19/h4-5,12-13,15,17-18,22-24,26-27,35-36H,6-11,14,16H2,1-3H3
82 atoms
O  -2.447021 0.070161 -1.402172
O  4.881263 1.123125 0.956556
O  -0.784919 0.11626 -3.675945
O  -1.917565 2.916864 1.051119
O  3.53395 -1.314957 -1.144568
O  -5.169254 0.108105 1.568666
O  5.279555 -0.960768 1.69298
O  -3.943214 1.38176 2.868485
O  5.566936 -2.160541 -1.546202
N  -8.14675 -2.914873 -0.478448
C  0.711246 1.716929 0.052639
C  1.610429 0.82766 -0.855649
C  -0.705176 1.06622 -0.023842
C  3.143292 1.056196 -0.735141
C  -1.302674 0.970965 -1.439812
C  1.085507 0.82839 -2.289533
C  1.20347 1.580307 1.503941
C  -0.312173 0.231259 -2.35527
C  3.477926 0.891758 0.759104
C  2.698105 1.82691 1.660126
C  -1.731996 1.5163 1.024175
C  0.744588 3.203543 -0.344556
C  3.919534 0.001538 -1.537324
C  3.636764 2.393841 -1.299714
C  -1.810869 2.269972 -2.049114
C  -3.026256 0.793362 0.776027
C  -3.282636 0.120725 -0.384768
C  5.670943 0.138173 1.373205
C  -4.015528 0.810051 1.801235
C  7.087552 0.551043 1.378351
C  -4.508708 -0.588102 -0.563745
C  8.018597 -0.13048 2.34617
C  8.093318 -0.474554 0.908334
C  4.433373 -2.292412 -1.146211
C  3.902227 -3.56136 -0.611148
C  -5.410595 -0.566926 0.435585
C  2.933312 -3.559307 0.546059
C  2.453747 -3.937821 -0.803305
C  -6.725935 -1.207265 0.418852
C  -7.773482 -0.743387 1.212879
C  -6.973641 -2.3102 -0.399494
C  -9.000906 -1.37555 1.132314
C  -9.141324 -2.450633 0.26964
H  1.454064 -0.19162 -0.478441
H  -0.526942 0.019465 0.262267
H  1.087822 1.834787 -2.719519
H  1.717042 0.220616 -2.939917
H  0.979681 0.57079 1.867129
H  0.661063 2.271399 2.153553
H  -0.246841 -0.79651 -1.979049
H  3.235213 -0.130796 1.057643
H  2.952939 2.869924 1.457943
H  2.982372 1.637414 2.698325
H  -1.353151 1.183612 1.998077
H  -0.160595 3.719068 -0.042571
H  0.872922 3.366579 -1.412809
H  1.567825 3.721676 0.144675
H  4.991147 0.14368 -1.390872
H  3.7377 0.114828 -2.608528
H  3.210105 2.585881 -2.284741
H  3.395611 3.245533 -0.669829
H  4.721356 2.389917 -1.422454
H  -2.478857 2.801882 -1.374623
H  -2.366099 2.06774 -2.965644
H  -0.997224 2.946624 -2.300728
H  -0.673065 0.962855 -4.122991
H  -2.450646 3.128642 1.825733
H  7.284662 1.586666 1.13359
H  -4.712984 -1.0951 -1.495572
H  7.588337 -0.853032 3.027485
H  8.80057 0.483951 2.772132
H  8.924125 -0.098681 0.326275
H  7.709865 -1.433436 0.584097
H  4.624864 -4.366542 -0.639554
H  3.073158 -4.339192 1.282875
H  2.631336 -2.605118 0.957163
H  1.814328 -3.249539 -1.340298
H  2.258451 -4.98233 -1.007784
H  -7.645432 0.104197 1.87278
H  -6.178602 -2.732294 -1.004521
H  -9.838828 -1.038669 1.726821
H  -10.093504 -2.961074 0.181458
elementType: O N C H
totalener: -2013.01113094 hartree
nucrepener: 5455.11065792 hartree
electener: -7468.12178886 hartree
twoeener: 6134.61565571 hartree
cpcmener: -0.06494583 hartree
kineticenergy: 2004.21874242 hartree
xcener: -192.186394735936 hartree
chargesum: 0.0000000
charge: -0.312013 -0.321087 -0.425431 -0.405206 -0.280818 -0.232150 -0.475599 -0.485301 -0.472174 -0.365177 0.641009 -0.287950 -0.230825 0.410777 0.416458 -0.398643 -0.355707 0.196130 0.159445 -0.274460 0.118166 -0.460088 -0.111853 -0.405643 -0.381529 -0.295907 0.303013 0.399974 0.368665 -0.113464 -0.272471 -0.147649 -0.153620 0.392161 -0.087485 0.386384 -0.164877 -0.151297 -0.045879 -0.127029 0.006270 -0.155354 0.042099 0.104626 0.123740 0.108473 0.094981 0.108943 0.090259 0.097560 0.093805 0.093925 0.090475 0.115863 0.123755 0.106154 0.111338 0.119020 0.140201 0.117740 0.113745 0.109473 0.112778 0.106168 0.123988 0.224299 0.214029 0.100041 0.138254 0.091766 0.102165 0.101867 0.092103 0.100771 0.103223 0.098553 0.094286 0.102092 0.153615 0.128347 0.155946 0.147769
qa: -0.3120 -0.3211 -0.4254 -0.4052 -0.2808 -0.2321 -0.4756 -0.4853 -0.4722 -0.3652 0.6410 -0.2880 -0.2308 0.4108 0.4165 -0.3986 -0.3557 0.1961 0.1594 -0.2745 0.1182 -0.4601 -0.1119 -0.4056 -0.3815 -0.2959 0.3030 0.4000 0.3687 -0.1135 -0.2725 -0.1476 -0.1536 0.3922 -0.0875 0.3864 -0.1649 -0.1513 -0.0459 -0.1270 0.0063 -0.1554 0.0421 0.1046 0.1237 0.1085 0.0950 0.1089 0.0903 0.0976 0.0938 0.0939 0.0905 0.1159 0.1238 0.1062 0.1113 0.1190 0.1402 0.1177 0.1137 0.1095 0.1128 0.1062 0.1240 0.2243 0.2140 0.1000 0.1383 0.0918 0.1022 0.1019 0.0921 0.1008 0.1032 0.0986 0.0943 0.1021 0.1536 0.1283 0.1559 0.1478
va: 2.1939 2.1198 2.0260 1.9830 2.0932 2.2090 2.0253 2.0401 2.0254 3.0703 3.2893 4.0110 3.9016 3.6019 3.6431 4.0794 3.9387 3.8966 3.6441 4.0521 4.0034 3.9331 3.7894 3.9482 3.9387 3.5866 4.0713 4.1581 4.3392 3.7863 4.0101 3.9193 3.9030 4.1459 3.7977 3.7766 3.9130 3.9064 3.6908 3.9540 4.0676 3.9268 3.9802 1.0077 1.0117 1.0015 1.0370 0.9943 1.0260 1.0334 1.0443 1.0096 1.0210 1.0039 1.0353 0.9913 1.0022 1.0254 0.9960 0.9992 0.9970 1.0086 1.0324 1.0246 0.9907 1.0123 1.0272 1.0244 1.0191 1.0266 1.0166 1.0157 1.0332 1.0186 1.0160 1.0135 1.0184 1.0169 1.0132 1.0105 0.9943 0.9977
dispcorr: -0.055298120 hartree
energy: -2013.066429063845
dipole: 40.07652 -40.48838 -0.41186 13.03768 -11.52688 1.51080 -6.52969 5.78503 -0.74467
magnitude: 1.73398 au
magnitude: 4.40742 debye
