program: Orca
programVersion: 5.0.2
elementType: O O O O O O O O O N C C C C C C C C C C C C C C C C C C C C C C C C C C C C C C C C C H H H H H H H H H H H H H H H H H H H H H H H H H H H H H H H H H H H H H H H
charge: 0
multiplicity: 1
keywords: wb97x-d3
keywords: def2-TZVPP
keywords: def2/J RIJCOSX
keywords: DEFGRID2
keywords: scfconv7
keywords: smallprint printgap noloewdin
keywords: NOSOSCF
formula: C33H39NO9
InChI: InChI=1/C33H39NO9/c1-31-11-10-24(42-29(38)18-8-9-18)32(2,16-40-28(37)17-6-7-17)22(31)14-23(35)33(3)27(31)26(36)25-21(43-33)13-20(41-30(25)39)19-5-4-12-34-15-19/h4-5,12-13,15,17-18,22-24,26-27,35-36H,6-11,14,16H2,1-3H3
82 atoms
O  -2.840115 -0.15472 -1.283031
O  4.503782 0.694104 1.21268
O  -1.116568 -0.673378 -3.449876
O  -2.07301 3.001864 0.681793
O  4.808955 -0.958061 -0.977981
O  -5.623751 0.688502 1.503102
O  4.79584 -1.321574 2.158322
O  -4.282724 1.986227 2.65735
O  4.906603 -2.964473 -1.955138
N  -9.085844 -1.774384 -0.56981
C  0.437055 1.406009 -0.000244
C  1.273686 0.288899 -0.693871
C  -1.035287 0.885742 -0.021542
C  2.827711 0.384964 -0.548882
C  -1.606989 0.607851 -1.422744
C  0.777375 0.09472 -2.128857
C  0.870448 1.496224 1.470683
C  -0.671675 -0.370713 -2.1496
C  3.102859 0.496942 0.964927
C  2.373906 1.642461 1.63708
C  -2.034704 1.605476 0.894309
C  0.624626 2.786335 -0.655943
C  3.380852 -0.95564 -1.059269
C  3.460625 1.523541 -1.351257
C  -1.960704 1.82397 -2.268063
C  -3.392875 0.98738 0.714411
C  -3.693014 0.158741 -0.328604
C  5.225497 -0.247032 1.807264
C  -4.397839 1.273836 1.682732
C  6.620595 0.196695 2.006924
C  -4.980002 -0.449773 -0.433061
C  7.292378 -0.194959 3.301823
C  7.698308 -0.855083 2.040206
C  5.458702 -2.000098 -1.477908
C  6.921991 -1.827776 -1.381529
C  -5.909848 -0.146814 0.493553
C  7.761648 -3.05975 -1.153565
C  7.765968 -2.41397 -2.486062
C  -7.285137 -0.646851 0.54083
C  -8.083648 -0.48156 1.672135
C  -7.853066 -1.298605 -0.555776
C  -9.375312 -0.976084 1.658193
C  -9.831137 -1.617491 0.518663
H  1.015916 -0.634353 -0.153066
H  -0.968905 -0.108561 0.44365
H  0.891686 1.010741 -2.715378
H  1.35079 -0.669243 -2.653945
H  0.547386 0.593214 2.00103
H  0.376447 2.338634 1.960284
H  -0.719379 -1.316628 -1.597659
H  2.776938 -0.436945 1.432871
H  2.724988 2.602044 1.249284
H  2.616773 1.635054 2.70277
H  -1.717002 1.404707 1.924424
H  0.807309 2.741169 -1.727546
H  1.473975 3.313017 -0.223982
H  -0.238971 3.423134 -0.499507
H  3.101618 -1.115036 -2.100572
H  2.974017 -1.783267 -0.470043
H  3.20282 2.506806 -0.967118
H  4.548118 1.462654 -1.352451
H  3.139681 1.48646 -2.393625
H  -1.073238 2.360374 -2.595399
H  -2.586003 2.530156 -1.725206
H  -2.509275 1.519445 -3.159995
H  -0.894446 0.058777 -4.035822
H  -2.588106 3.395291 1.395093
H  6.877455 1.16191 1.589914
H  -5.185861 -1.133601 -1.243134
H  6.708169 -0.76213 4.015098
H  7.953728 0.540006 3.740982
H  8.647386 -0.585005 1.596316
H  7.398252 -1.882498 1.879273
H  7.263312 -0.90412 -0.932456
H  8.628134 -2.939965 -0.516776
H  7.243185 -4.002996 -1.039803
H  7.250004 -2.906901 -3.299813
H  8.633706 -1.839474 -2.782073
H  -7.711352 0.018142 2.555916
H  -7.288917 -1.431979 -1.471655
H  -10.019698 -0.867406 2.519523
H  -10.837133 -2.019143 0.479577
elementType: O N C H
totalener: -2013.00907102 hartree
nucrepener: 5336.78389908 hartree
electener: -7349.79297010 hartree
twoeener: 6016.26446573 hartree
cpcmener: -0.06569768 hartree
kineticenergy: 2004.22298433 hartree
xcener: -192.186371128996 hartree
chargesum: 0.0000000
charge: -0.310343 -0.309445 -0.423909 -0.404505 -0.283067 -0.231515 -0.479782 -0.485598 -0.484024 -0.364982 0.638206 -0.299825 -0.232794 0.436026 0.422313 -0.398719 -0.351150 0.193965 0.173323 -0.275083 0.130704 -0.469526 -0.139709 -0.407751 -0.382569 -0.303868 0.299215 0.407148 0.364190 -0.127660 -0.253647 -0.164908 -0.160744 0.439129 -0.135307 0.371225 -0.145096 -0.151475 -0.042516 -0.126196 0.009401 -0.155083 0.043628 0.119213 0.121958 0.108787 0.095616 0.108576 0.088442 0.097731 0.105091 0.091761 0.089785 0.116970 0.110269 0.112671 0.122356 0.118953 0.129250 0.117755 0.104382 0.114070 0.124416 0.112299 0.106878 0.224150 0.213724 0.101655 0.134629 0.096535 0.103326 0.106848 0.094767 0.104804 0.100894 0.093836 0.094362 0.102363 0.154725 0.124713 0.155731 0.148026
qa: -0.3103 -0.3094 -0.4239 -0.4045 -0.2831 -0.2315 -0.4798 -0.4856 -0.4840 -0.3650 0.6382 -0.2998 -0.2328 0.4360 0.4223 -0.3987 -0.3511 0.1940 0.1733 -0.2751 0.1307 -0.4695 -0.1397 -0.4078 -0.3826 -0.3039 0.2992 0.4071 0.3642 -0.1277 -0.2536 -0.1649 -0.1607 0.4391 -0.1353 0.3712 -0.1451 -0.1515 -0.0425 -0.1262 0.0094 -0.1551 0.0436 0.1192 0.1220 0.1088 0.0956 0.1086 0.0884 0.0977 0.1051 0.0918 0.0898 0.1170 0.1103 0.1127 0.1224 0.1190 0.1292 0.1178 0.1044 0.1141 0.1244 0.1123 0.1069 0.2242 0.2137 0.1017 0.1346 0.0965 0.1033 0.1068 0.0948 0.1048 0.1009 0.0938 0.0944 0.1024 0.1547 0.1247 0.1557 0.1480
va: 2.1937 2.1162 2.0266 1.9851 2.1170 2.2090 2.0223 2.0396 2.0268 3.0687 3.2822 4.0533 3.9038 3.6208 3.6446 4.0744 3.9532 3.9198 3.6351 4.0390 3.9959 3.9436 3.8475 3.9507 3.9385 3.5848 4.0918 4.1488 4.3393 3.7800 4.0311 3.9474 3.8936 4.0836 3.8149 3.7999 3.9021 3.9304 3.6894 3.9555 4.0651 3.9229 3.9769 0.9980 1.0149 1.0005 1.0408 0.9942 1.0272 1.0279 1.0406 1.0115 1.0212 1.0031 0.9893 1.0005 1.0344 1.0150 1.0061 0.9935 1.0209 0.9985 0.9907 1.0319 1.0243 1.0123 1.0272 1.0255 1.0239 1.0252 1.0169 1.0132 1.0245 1.0112 1.0173 1.0272 1.0286 1.0173 1.0153 1.0145 0.9946 0.9976
dispcorr: -0.053734134 hartree
energy: -2013.062805153874
dipole: 50.64199 -49.27239 1.36959 8.82373 -7.21200 1.61173 -8.15550 7.77970 -0.37580
magnitude: 2.14819 au
magnitude: 5.46026 debye
