program: Orca
programVersion: 5.0.2
elementType: O O O O O O O O O N C C C C C C C C C C C C C C C C C C C C C C C C C C C C C C C C C H H H H H H H H H H H H H H H H H H H H H H H H H H H H H H H H H H H H H H H
charge: 0
multiplicity: 1
keywords: wb97x-d3
keywords: def2-TZVPP
keywords: def2/J RIJCOSX
keywords: DEFGRID2
keywords: scfconv7
keywords: smallprint printgap noloewdin
keywords: NOSOSCF
formula: C33H39NO9
InChI: InChI=1/C33H39NO9/c1-31-11-10-24(42-29(38)18-8-9-18)32(2,16-40-28(37)17-6-7-17)22(31)14-23(35)33(3)27(31)26(36)25-21(43-33)13-20(41-30(25)39)19-5-4-12-34-15-19/h4-5,12-13,15,17-18,22-24,26-27,35-36H,6-11,14,16H2,1-3H3
82 atoms
O  -2.533221 0.173537 -1.434503
O  4.891089 0.777956 0.818379
O  -0.909294 0.360291 -3.725131
O  -1.816146 2.730904 1.2924
O  3.460353 -1.495542 -1.394777
O  -5.218988 0.083503 1.568288
O  5.058914 -0.819587 2.378313
O  -3.902972 1.144427 2.966616
O  5.521014 -2.058863 -0.699899
N  -8.428671 -2.480434 -0.746884
C  0.717082 1.546823 0.095726
C  1.569762 0.710347 -0.904876
C  -0.722751 0.952684 -0.005875
C  3.113994 0.875711 -0.799157
C  -1.349515 1.021629 -1.409288
C  1.015522 0.861756 -2.321392
C  1.231774 1.274416 1.518588
C  -0.407839 0.331615 -2.410134
C  3.476752 0.596103 0.669302
C  2.733955 1.472504 1.658619
C  -1.70835 1.334461 1.107262
C  0.796258 3.060814 -0.173973
C  3.830623 -0.148337 -1.698966
C  3.636971 2.23295 -1.283938
C  -1.80856 2.394543 -1.880952
C  -3.045354 0.713648 0.811719
C  -3.355162 0.17545 -0.404595
C  5.5700 0.010478 1.661674
C  -4.021284 0.6869 1.849713
C  7.0217 0.278012 1.642083
C  -4.625978 -0.433492 -0.633319
C  7.726548 0.57616 0.341091
C  7.557239 1.655768 1.341347
C  4.354713 -2.329567 -0.867236
C  3.73727 -3.618615 -0.50047
C  -5.516227 -0.455128 0.376612
C  4.619355 -4.838319 -0.452851
C  4.166886 -4.225819 0.816293
C  -6.871902 -1.002865 0.318643
C  -7.86607 -0.581647 1.200418
C  -7.215445 -1.968213 -0.628979
C  -9.135199 -1.118109 1.079981
C  -9.370007 -2.057998 0.089605
H  1.386037 -0.333676 -0.616876
H  -0.57566 -0.122456 0.171063
H  1.052063 1.902268 -2.657349
H  1.606577 0.291103 -3.039562
H  0.990464 0.24367 1.802737
H  0.721085 1.92163 2.235415
H  -0.379647 -0.728313 -2.132206
H  3.220562 -0.443499 0.896886
H  3.013058 2.520977 1.529719
H  3.032369 1.199322 2.673517
H  -1.331141 0.875875 2.029463
H  1.640826 3.508933 0.347092
H  -0.088322 3.577778 0.18175
H  0.919875 3.312169 -1.225525
H  4.909978 -0.021875 -1.620424
H  3.572447 0.016075 -2.745329
H  4.721567 2.216325 -1.405156
H  3.216597 2.488266 -2.257384
H  3.407298 3.050175 -0.605774
H  -2.438442 2.889891 -1.144332
H  -2.389899 2.30469 -2.799159
H  -0.970324 3.055705 -2.086949
H  -0.770249 1.239292 -4.09483
H  -2.32189 2.882953 2.098699
H  7.56886 -0.312235 2.365753
H  -4.869745 -0.830088 -1.608146
H  7.1340 0.610417 -0.563419
H  8.705027 0.130878 0.218402
H  8.418719 1.966421 1.917834
H  6.846714 2.445355 1.135768
H  2.70383 -3.754789 -0.792311
H  4.166541 -5.769181 -0.767879
H  5.655229 -4.717573 -0.742663
H  4.883637 -3.672691 1.409598
H  3.394432 -4.722705 1.387914
H  -7.665046 0.16101 1.960805
H  -6.467921 -2.356018 -1.312239
H  -9.933188 -0.809561 1.741025
H  -10.3565 -2.490472 -0.032313
elementType: O N C H
totalener: -2013.01081552 hartree
nucrepener: 5434.30905912 hartree
electener: -7447.31987463 hartree
twoeener: 6114.17871336 hartree
cpcmener: -0.06447167 hartree
kineticenergy: 2004.20813831 hartree
xcener: -192.185236862611 hartree
chargesum: 0.0000000
charge: -0.312032 -0.293375 -0.425235 -0.405173 -0.304589 -0.232089 -0.479591 -0.485076 -0.473072 -0.364752 0.640591 -0.291991 -0.228388 0.421316 0.415913 -0.395266 -0.358510 0.196589 0.096791 -0.258372 0.117258 -0.468691 -0.108847 -0.404208 -0.382234 -0.292591 0.300968 0.393743 0.366894 -0.093221 -0.270762 -0.167854 -0.150985 0.402690 -0.083082 0.383652 -0.145937 -0.158067 -0.044645 -0.125337 0.007118 -0.155616 0.041658 0.118167 0.122086 0.107606 0.094571 0.108577 0.091189 0.098248 0.097219 0.093719 0.092029 0.116233 0.111173 0.124049 0.107905 0.121517 0.139940 0.107129 0.120594 0.115274 0.112056 0.106029 0.123937 0.224375 0.213911 0.099657 0.137791 0.097190 0.102074 0.100925 0.094911 0.102246 0.102857 0.091550 0.092907 0.101010 0.153306 0.126978 0.155616 0.147859
qa: -0.3120 -0.2934 -0.4252 -0.4052 -0.3046 -0.2321 -0.4796 -0.4851 -0.4731 -0.3648 0.6406 -0.2920 -0.2284 0.4213 0.4159 -0.3953 -0.3585 0.1966 0.0968 -0.2584 0.1173 -0.4687 -0.1088 -0.4042 -0.3822 -0.2926 0.3010 0.3937 0.3669 -0.0932 -0.2708 -0.1679 -0.1510 0.4027 -0.0831 0.3837 -0.1459 -0.1581 -0.0446 -0.1253 0.0071 -0.1556 0.0417 0.1182 0.1221 0.1076 0.0946 0.1086 0.0912 0.0982 0.0972 0.0937 0.0920 0.1162 0.1112 0.1240 0.1079 0.1215 0.1399 0.1071 0.1206 0.1153 0.1121 0.1060 0.1239 0.2244 0.2139 0.0997 0.1378 0.0972 0.1021 0.1009 0.0949 0.1022 0.1029 0.0915 0.0929 0.1010 0.1533 0.1270 0.1556 0.1479
va: 2.1937 2.1037 2.0255 1.9835 2.1123 2.2091 2.0125 2.0401 2.0290 3.0701 3.2852 3.9858 3.8998 3.6170 3.6435 4.0827 3.9630 3.9080 3.7087 4.0285 4.0023 3.9435 3.8257 3.9525 3.9402 3.5863 4.0725 4.1467 4.3396 3.7988 4.0144 3.9163 3.9041 4.1268 3.7848 3.7787 3.9198 3.9057 3.6895 3.9536 4.0681 3.9266 3.9797 1.0090 1.0139 1.0002 1.0386 0.9946 1.0257 1.0293 1.0363 1.0108 1.0300 1.0033 1.0020 1.0338 0.9901 1.0300 1.0001 1.0068 0.9989 0.9961 1.0312 1.0247 0.9908 1.0122 1.0278 1.0190 1.0199 1.0163 1.0159 1.0168 1.0209 1.0203 1.0162 1.0268 1.0329 1.0160 1.0138 1.0114 0.9945 0.9977
dispcorr: -0.055150402 hartree
energy: -2013.065965917750
dipole: 43.50332 -43.61519 -0.11187 13.29443 -12.00011 1.29433 -8.36766 6.66013 -1.70753
magnitude: 2.14557 au
magnitude: 5.45360 debye
