program: Orca
programVersion: 5.0.2
elementType: O O O O O O O O O N C C C C C C C C C C C C C C C C C C C C C C C C C C C C C C C C C H H H H H H H H H H H H H H H H H H H H H H H H H H H H H H H H H H H H H H H
charge: 0
multiplicity: 1
keywords: wb97x-d3
keywords: def2-TZVPP
keywords: def2/J RIJCOSX
keywords: DEFGRID2
keywords: scfconv7
keywords: smallprint printgap noloewdin
keywords: NOSOSCF
formula: C33H39NO9
InChI: InChI=1/C33H39NO9/c1-31-11-10-24(42-29(38)18-8-9-18)32(2,16-40-28(37)17-6-7-17)22(31)14-23(35)33(3)27(31)26(36)25-21(43-33)13-20(41-30(25)39)19-5-4-12-34-15-19/h4-5,12-13,15,17-18,22-24,26-27,35-36H,6-11,14,16H2,1-3H3
82 atoms
O  -2.305733 -0.027815 -1.396121
O  5.02449 1.127132 0.911643
O  -0.645484 -0.021566 -3.671241
O  -1.757114 2.870904 1.024852
O  3.680622 -1.424212 -1.066192
O  -5.063333 0.145931 1.532531
O  5.330434 -0.569902 2.346103
O  -3.82042 1.408053 2.827766
O  3.236131 -2.218966 -3.115229
N  -8.326845 -2.376353 -0.781941
C  0.849222 1.652144 0.026226
C  1.749966 0.749502 -0.867316
C  -0.566086 0.998204 -0.038736
C  3.28337 0.973368 -0.749872
C  -1.163711 0.874583 -1.45215
C  1.221399 0.734934 -2.300962
C  1.339356 1.539732 1.479537
C  -0.170171 0.122739 -2.354336
C  3.624358 0.854917 0.745815
C  2.831228 1.796291 1.630194
C  -1.591672 1.467914 1.002266
C  0.884038 3.131202 -0.399482
C  4.042429 -0.119547 -1.522007
C  3.782819 2.287922 -1.359252
C  -1.673941 2.162086 -2.083347
C  -2.895686 0.762946 0.755124
C  -3.151098 0.06208 -0.388858
C  5.757625 0.374385 1.723067
C  -3.893967 0.818351 1.769786
C  7.158246 0.84036 1.7635
C  -4.377057 -0.649433 -0.553353
C  7.916557 0.67152 3.05596
C  8.237968 -0.204047 1.906542
C  3.26434 -2.35767 -1.914707
C  2.846592 -3.600557 -1.23587
C  -5.300601 -0.571207 0.424453
C  3.54052 -4.069744 0.019514
C  2.154414 -3.555404 0.105255
C  -6.618342 -1.21025 0.430891
C  -7.397293 -1.265856 1.586473
C  -7.147885 -1.781855 -0.728174
C  -8.632544 -1.88623 1.531758
C  -9.053433 -2.428787 0.329191
H  1.590107 -0.263718 -0.474437
H  -0.386681 -0.04305 0.26633
H  1.208653 1.739396 -2.734755
H  1.855088 0.135294 -2.954983
H  1.119319 0.53499 1.858206
H  0.794257 2.23909 2.117766
H  -0.09429 -0.897318 -1.958106
H  3.413677 -0.168561 1.066972
H  3.080137 2.836174 1.405302
H  3.117249 1.631309 2.672364
H  -1.2209 1.133721 1.978924
H  -0.022977 3.653165 -0.115988
H  1.020417 3.272584 -1.469645
H  1.704606 3.658565 0.084405
H  5.116841 -0.011957 -1.358644
H  3.874942 -0.021757 -2.59418
H  4.86817 2.279806 -1.472519
H  3.364958 2.441963 -2.354699
H  3.533907 3.1621 -0.763246
H  -0.86047 2.834481 -2.347052
H  -2.341431 2.705355 -1.417097
H  -2.229787 1.943599 -2.995827
H  -0.524254 0.811331 -4.140968
H  -2.286028 3.091546 1.800035
H  7.386547 1.711234 1.162785
H  -4.543716 -1.230989 -1.447755
H  7.382498 0.24417 3.894669
H  8.606633 1.463589 3.314361
H  9.153064 -0.026431 1.357569
H  7.926984 -1.239985 1.945475
H  2.519199 -4.367089 -1.926007
H  3.702166 -5.136452 0.100653
H  4.343042 -3.462056 0.416288
H  1.988931 -2.588575 0.562259
H  1.34714 -4.261722 0.246627
H  -7.052471 -0.841208 2.519256
H  -6.597834 -1.74694 -1.661472
H  -9.260062 -1.949794 2.409846
H  -10.015078 -2.923597 0.256788
elementType: O N C H
totalener: -2013.01029077 hartree
nucrepener: 5451.84667617 hartree
electener: -7464.85696694 hartree
twoeener: 6131.08255625 hartree
cpcmener: -0.06456683 hartree
kineticenergy: 2004.21324212 hartree
xcener: -192.186101696954 hartree
chargesum: 0.0000000
charge: -0.312135 -0.320394 -0.425542 -0.405736 -0.288723 -0.231013 -0.488474 -0.488149 -0.469965 -0.364337 0.648703 -0.263846 -0.247543 0.439175 0.427107 -0.427154 -0.360479 0.204320 0.116707 -0.242131 0.123060 -0.460392 -0.125402 -0.407414 -0.383035 -0.292043 0.299015 0.442623 0.361717 -0.131001 -0.255494 -0.150093 -0.153748 0.415667 -0.106594 0.370616 -0.151311 -0.156452 -0.040982 -0.126921 0.008332 -0.154092 0.042732 0.075767 0.123675 0.115297 0.095399 0.109142 0.089899 0.095211 0.096610 0.090848 0.091600 0.115854 0.123264 0.107153 0.111245 0.122338 0.137527 0.108465 0.116744 0.113619 0.123968 0.111939 0.106419 0.224024 0.213988 0.100570 0.135301 0.093892 0.102199 0.101835 0.095135 0.101154 0.101636 0.095110 0.097203 0.103578 0.154155 0.125398 0.155359 0.148300
qa: -0.3121 -0.3204 -0.4255 -0.4057 -0.2887 -0.2310 -0.4885 -0.4881 -0.4700 -0.3643 0.6487 -0.2638 -0.2475 0.4392 0.4271 -0.4272 -0.3605 0.2043 0.1167 -0.2421 0.1231 -0.4604 -0.1254 -0.4074 -0.3830 -0.2920 0.2990 0.4426 0.3617 -0.1310 -0.2555 -0.1501 -0.1537 0.4157 -0.1066 0.3706 -0.1513 -0.1565 -0.0410 -0.1269 0.0083 -0.1541 0.0427 0.0758 0.1237 0.1153 0.0954 0.1091 0.0899 0.0952 0.0966 0.0908 0.0916 0.1159 0.1233 0.1072 0.1112 0.1223 0.1375 0.1085 0.1167 0.1136 0.1240 0.1119 0.1064 0.2240 0.2140 0.1006 0.1353 0.0939 0.1022 0.1018 0.0951 0.1012 0.1016 0.0951 0.0972 0.1036 0.1542 0.1254 0.1554 0.1483
va: 2.1945 2.1292 2.0263 1.9830 2.0978 2.2107 2.0166 2.0364 2.0389 3.0688 3.2887 4.0417 3.9104 3.5699 3.6351 4.0566 3.9589 3.8838 3.6871 4.0262 4.0083 3.9343 3.8217 3.9593 3.9422 3.5827 4.0905 4.1060 4.3410 3.8149 4.0376 3.9080 3.9031 4.1471 3.7922 3.8034 3.9136 3.9028 3.6886 3.9569 4.0650 3.9224 3.9772 1.0312 1.0116 1.0043 1.0502 0.9938 1.0269 1.0328 1.0466 1.0109 1.0235 1.0038 1.0349 0.9913 1.0021 1.0142 1.0115 1.0092 0.9982 0.9968 0.9906 1.0313 1.0245 1.0123 1.0281 1.0230 1.0242 1.0264 1.0166 1.0169 1.0253 1.0195 1.0168 1.0236 1.0136 1.0154 1.0157 1.0147 0.9948 0.9974
dispcorr: -0.054537674 hartree
energy: -2013.064828440196
dipole: 43.74761 -42.58815 1.15946 12.21170 -11.36046 0.85124 -2.88155 3.12043 0.23888
magnitude: 1.45809 au
magnitude: 3.70616 debye
