program: Orca
programVersion: 5.0.2
elementType: O O O O O O O O O N C C C C C C C C C C C C C C C C C C C C C C C C C C C C C C C C C H H H H H H H H H H H H H H H H H H H H H H H H H H H H H H H H H H H H H H H
charge: 0
multiplicity: 1
keywords: wb97x-d3
keywords: def2-TZVPP
keywords: def2/J RIJCOSX
keywords: DEFGRID2
keywords: scfconv7
keywords: smallprint printgap noloewdin
keywords: NOSOSCF
formula: C33H39NO9
InChI: InChI=1/C33H39NO9/c1-31-11-10-24(42-29(38)18-8-9-18)32(2,16-40-28(37)17-6-7-17)22(31)14-23(35)33(3)27(31)26(36)25-21(43-33)13-20(41-30(25)39)19-5-4-12-34-15-19/h4-5,12-13,15,17-18,22-24,26-27,35-36H,6-11,14,16H2,1-3H3
82 atoms
O  -2.352364 0.093117 -1.456482
O  4.974981 1.060574 0.88201
O  -0.737819 0.227075 -3.716852
O  -1.819192 2.967092 0.963448
O  3.794592 -1.391617 -0.999047
O  -5.06747 0.15541 1.516226
O  5.192368 -0.73683 2.207481
O  -3.840943 1.438641 2.805965
O  2.576618 -2.189587 -2.706183
N  -8.295676 -2.434224 -0.77048
C  0.81661 1.732217 -0.008676
C  1.703281 0.82944 -0.920827
C  -0.608707 1.098401 -0.087857
C  3.239719 1.011997 -0.792396
C  -1.207784 0.99499 -1.505028
C  1.170903 0.874587 -2.351106
C  1.304749 1.597854 1.443647
C  -0.217795 0.254902 -2.409501
C  3.56334 0.870115 0.704239
C  2.802158 1.830447 1.594167
C  -1.634891 1.566393 0.952681
C  0.868048 3.219527 -0.400298
C  3.989262 -0.092947 -1.562647
C  3.764656 2.321709 -1.390372
C  -1.71601 2.293567 -2.117413
C  -2.928782 0.839467 0.714537
C  -3.184432 0.150272 -0.436519
C  5.672603 0.205201 1.620375
C  -3.913087 0.857758 1.743606
C  7.108069 0.550891 1.629822
C  -4.395122 -0.589831 -0.592871
C  7.897413 0.233565 2.87465
C  8.095607 -0.590211 1.660977
C  3.103425 -2.334795 -1.627508
C  3.055296 -3.600492 -0.868832
C  -5.302522 -0.552743 0.402039
C  4.262201 -4.069782 -0.090492
C  3.05939 -3.608314 0.640042
C  -6.597418 -1.236737 0.4254
C  -7.341188 -1.350595 1.599704
C  -7.138311 -1.797157 -0.733763
C  -8.553628 -2.015521 1.562817
C  -8.98783 -2.543126 0.358289
H  1.517591 -0.19009 -0.552957
H  -0.442784 0.052809 0.20882
H  1.14677 1.893151 -2.744414
H  1.805979 0.305673 -3.030942
H  1.071023 0.593442 1.814673
H  0.769322 2.299443 2.087876
H  -0.132918 -0.768744 -2.012482
H  3.293818 -0.141045 1.016186
H  3.072127 2.866482 1.376693
H  3.086456 1.650474 2.634328
H  -1.256778 1.244825 1.930534
H  0.956791 3.390494 -1.470909
H  1.720341 3.716779 0.059705
H  -0.014271 3.749752 -0.05808
H  5.063103 0.08875 -1.500991
H  3.728983 -0.082985 -2.620478
H  3.383565 2.471047 -2.401499
H  3.490785 3.198169 -0.80942
H  4.853443 2.316023 -1.461873
H  -2.381156 2.825267 -1.440055
H  -2.268259 2.093669 -3.034597
H  -0.900764 2.967744 -2.369264
H  -0.162868 -0.327388 -4.254723
H  -2.35051 3.18797 1.736727
H  7.388066 1.435802 1.073009
H  -4.560773 -1.164767 -1.491919
H  7.359904 -0.199493 3.708278
H  8.664848 0.944484 3.150251
H  9.001013 -0.456995 1.084074
H  7.694674 -1.59559 1.649484
H  2.465898 -4.364399 -1.359151
H  4.469783 -5.130903 -0.13066
H  5.141693 -3.439509 -0.087976
H  3.103417 -2.659696 1.158424
H  2.425664 -4.348463 1.110425
H  -6.985139 -0.937138 2.53337
H  -6.616736 -1.716592 -1.680675
H  -9.153175 -2.125003 2.455864
H  -9.931795 -3.072606 0.29886
elementType: O N C H
totalener: -2013.00926924 hartree
nucrepener: 5460.22719827 hartree
electener: -7473.23646751 hartree
twoeener: 6140.39393094 hartree
cpcmener: -0.05977282 hartree
kineticenergy: 2004.21635666 hartree
xcener: -192.187299182005 hartree
chargesum: -0.0000000
charge: -0.314108 -0.320004 -0.400674 -0.405067 -0.282002 -0.231829 -0.488827 -0.487254 -0.476030 -0.364642 0.585367 -0.279004 -0.238078 0.441217 0.548101 -0.355880 -0.366771 0.017794 0.119877 -0.242062 0.126283 -0.458967 -0.123805 -0.401763 -0.373934 -0.298386 0.299174 0.443011 0.363836 -0.135596 -0.255309 -0.150227 -0.150529 0.422568 -0.112631 0.371669 -0.152378 -0.158176 -0.041050 -0.127427 0.008934 -0.154022 0.042574 0.099328 0.124675 0.105148 0.101053 0.109527 0.090683 0.103500 0.090928 0.092981 0.090460 0.115366 0.109024 0.111630 0.124312 0.125064 0.134803 0.120266 0.115024 0.107463 0.114268 0.106503 0.117573 0.218889 0.213670 0.100828 0.135575 0.094034 0.102384 0.101801 0.094815 0.102170 0.102121 0.095510 0.098764 0.103018 0.153624 0.125813 0.155293 0.148138
qa: -0.3141 -0.3200 -0.4007 -0.4051 -0.2820 -0.2318 -0.4888 -0.4873 -0.4760 -0.3646 0.5854 -0.2790 -0.2381 0.4412 0.5481 -0.3559 -0.3668 0.0178 0.1199 -0.2421 0.1263 -0.4590 -0.1238 -0.4018 -0.3739 -0.2984 0.2992 0.4430 0.3638 -0.1356 -0.2553 -0.1502 -0.1505 0.4226 -0.1126 0.3717 -0.1524 -0.1582 -0.0411 -0.1274 0.0089 -0.1540 0.0426 0.0993 0.1247 0.1051 0.1011 0.1095 0.0907 0.1035 0.0909 0.0930 0.0905 0.1154 0.1090 0.1116 0.1243 0.1251 0.1348 0.1203 0.1150 0.1075 0.1143 0.1065 0.1176 0.2189 0.2137 0.1008 0.1356 0.0940 0.1024 0.1018 0.0948 0.1022 0.1021 0.0955 0.0988 0.1030 0.1536 0.1258 0.1553 0.1481
va: 2.2052 2.1226 2.0484 1.9827 2.0945 2.2092 2.0125 2.0377 2.0308 3.0688 3.4182 4.0121 3.9255 3.5832 3.5983 3.9356 3.9670 4.0480 3.6867 4.0281 4.0083 3.9264 3.8413 3.9523 3.9358 3.5810 4.0906 4.1003 4.3411 3.8192 4.0331 3.9106 3.9023 4.1369 3.7984 3.8012 3.9113 3.9040 3.6877 3.9569 4.0651 3.9231 3.9775 1.0149 1.0142 1.0167 1.0438 0.9930 1.0243 1.0334 1.0386 1.0093 1.0232 1.0044 0.9921 1.0018 1.0373 1.0133 1.0116 0.9960 0.9962 1.0109 1.0312 1.0267 0.9949 1.0148 1.0274 1.0228 1.0237 1.0263 1.0168 1.0168 1.0253 1.0191 1.0165 1.0209 1.0166 1.0164 1.0159 1.0143 0.9948 0.9975
dispcorr: -0.054849761 hartree
energy: -2013.064118999554
dipole: 46.55830 -44.33918 2.21913 10.55025 -10.83140 -0.28116 -3.35491 3.34088 -0.01403
magnitude: 2.23691 au
magnitude: 5.68577 debye
