program: Orca
programVersion: 5.0.2
elementType: O O O O O O O O O N C C C C C C C C C C C C C C C C C C C C C C C C C C C C C C C C C H H H H H H H H H H H H H H H H H H H H H H H H H H H H H H H H H H H H H H H
charge: 0
multiplicity: 1
keywords: wb97x-d3
keywords: def2-TZVPP
keywords: def2/J RIJCOSX
keywords: DEFGRID2
keywords: scfconv7
keywords: smallprint printgap noloewdin
keywords: NOSOSCF
formula: C33H39NO9
InChI: InChI=1/C33H39NO9/c1-31-11-10-24(42-29(38)18-8-9-18)32(2,16-40-28(37)17-6-7-17)22(31)14-23(35)33(3)27(31)26(36)25-21(43-33)13-20(41-30(25)39)19-5-4-12-34-15-19/h4-5,12-13,15,17-18,22-24,26-27,35-36H,6-11,14,16H2,1-3H3
82 atoms
O  -2.211635 -0.128771 -1.375774
O  5.090943 1.197371 0.901231
O  -0.57975 -0.06071 -3.635027
O  -1.702575 2.883822 0.941506
O  3.770742 -1.473026 -0.883049
O  -5.020332 0.193854 1.505073
O  5.250544 0.039614 2.817285
O  -3.80611 1.590189 2.703575
O  2.819934 -2.233748 -2.774733
N  -8.219842 -2.501983 -0.702906
C  0.904829 1.659445 0.000453
C  1.819485 0.733711 -0.853461
C  -0.501751 0.98575 -0.054124
C  3.350506 0.95007 -0.728342
C  -1.092716 0.793624 -1.467493
C  1.297966 0.686219 -2.287453
C  1.390381 1.610638 1.457606
C  -0.077972 0.035431 -2.330068
C  3.691944 0.919973 0.772957
C  2.878656 1.897644 1.60064
C  -1.540654 1.485525 0.959161
C  0.918733 3.126118 -0.468901
C  4.106877 -0.198534 -1.427037
C  3.853487 2.225479 -1.413339
C  -1.621973 2.053287 -2.140498
C  -2.839067 0.770878 0.720057
C  -3.072199 0.013103 -0.387213
C  5.751659 0.705189 1.950244
C  -3.860684 0.907823 1.712007
C  7.182832 1.0837 1.901504
C  -4.299409 -0.705336 -0.528826
C  7.895844 1.282647 3.213557
C  8.183303 0.07426 2.406007
C  3.114818 -2.37341 -1.61516
C  2.793082 -3.571798 -0.809166
C  -5.234193 -0.579825 0.433846
C  1.499164 -4.28453 -1.118171
C  2.784811 -4.904707 -1.512489
C  -6.548939 -1.226454 0.45339
C  -7.360423 -1.187727 1.586203
C  -7.047975 -1.89772 -0.665678
C  -8.590998 -1.81809 1.550444
C  -8.974711 -2.465103 0.386786
H  1.652469 -0.267232 -0.429854
H  -0.313458 -0.040786 0.295182
H  1.253093 1.680332 -2.73764
H  1.955185 0.096913 -2.927801
H  1.188995 0.617484 1.87717
H  0.826737 2.323258 2.063539
H  0.02395 -0.967195 -1.881549
H  3.492323 -0.087184 1.152539
H  3.113059 2.926892 1.318573
H  3.159466 1.796357 2.650449
H  -1.182381 1.176924 1.950723
H  0.00917 3.640532 -0.180732
H  1.037252 3.237648 -1.544385
H  1.742719 3.67335 -0.01451
H  5.178567 -0.072713 -1.266226
H  3.937215 -0.180505 -2.503477
H  4.942192 2.240046 -1.469258
H  3.477233 2.293381 -2.434686
H  3.55031 3.132595 -0.89833
H  -2.149426 1.794121 -3.056016
H  -0.816973 2.733091 -2.406083
H  -2.299385 2.598215 -1.486105
H  0.015181 -0.619495 -4.141305
H  -2.310423 3.103861 1.655922
H  7.481378 1.709201 1.07019
H  -4.452193 -1.328908 -1.395888
H  7.309977 1.163765 4.114871
H  8.634281 2.071875 3.252524
H  9.123437 0.012447 1.874846
H  7.794537 -0.873499 2.752889
H  3.119507 -3.550707 0.222414
H  0.956736 -4.694503 -0.277205
H  0.87743 -3.863928 -1.897032
H  3.046652 -4.909873 -2.561741
H  3.149644 -5.752709 -0.949115
H  -7.03691 -0.675697 2.48153
H  -6.475584 -1.938033 -1.585863
H  -9.243222 -1.808498 2.412571
H  -9.930576 -2.972922 0.326398
totalener: -2012.96509584 hartree
nucrepener: 5438.36707243 hartree
electener: -7451.33216827 hartree
twoeener: 6118.38096974 hartree
kineticenergy: 2004.32763952 hartree
xcener: -192.194773639495 hartree
chargesum: -0.0000000
charge: -0.287451 -0.308737 -0.318892 -0.355318 -0.283693 -0.223304 -0.390033 -0.388094 -0.401732 -0.294235 0.684358 -0.296328 -0.324285 0.440603 0.536704 -0.388510 -0.394448 0.049396 0.092351 -0.266472 0.103980 -0.445696 -0.124401 -0.388449 -0.355319 -0.277469 0.250622 0.367561 0.323205 -0.118016 -0.230918 -0.132964 -0.135868 0.352622 -0.083666 0.344581 -0.144354 -0.131030 -0.035270 -0.122522 -0.012014 -0.121649 0.035058 0.088084 0.112847 0.104187 0.101569 0.105294 0.096724 0.072586 0.107064 0.089206 0.102613 0.109056 0.141320 0.097838 0.098246 0.118238 0.134067 0.107876 0.110774 0.108386 0.117776 0.099936 0.114986 0.170730 0.186821 0.081576 0.118684 0.093194 0.083405 0.083216 0.093156 0.093545 0.087376 0.092027 0.091732 0.087153 0.148505 0.100858 0.126986 0.122457
qa: -0.2875 -0.3087 -0.3189 -0.3553 -0.2837 -0.2233 -0.3900 -0.3881 -0.4017 -0.2942 0.6844 -0.2963 -0.3243 0.4406 0.5367 -0.3885 -0.3944 0.0494 0.0924 -0.2665 0.1040 -0.4457 -0.1244 -0.3884 -0.3553 -0.2775 0.2506 0.3676 0.3232 -0.1180 -0.2309 -0.1330 -0.1359 0.3526 -0.0837 0.3446 -0.1444 -0.1310 -0.0353 -0.1225 -0.0120 -0.1216 0.0351 0.0881 0.1128 0.1042 0.1016 0.1053 0.0967 0.0726 0.1071 0.0892 0.1026 0.1091 0.1413 0.0978 0.0982 0.1182 0.1341 0.1079 0.1108 0.1084 0.1178 0.0999 0.1150 0.1707 0.1868 0.0816 0.1187 0.0932 0.0834 0.0832 0.0932 0.0935 0.0874 0.0920 0.0917 0.0872 0.1485 0.1009 0.1270 0.1225
va: 2.2274 2.1270 2.1308 2.0368 2.1222 2.2234 2.1183 2.1376 2.0997 3.1084 3.1577 3.9999 4.0100 3.5999 3.6435 3.9374 3.9727 4.0482 3.6747 3.9893 4.0495 3.9381 3.8548 3.9656 3.9517 3.5743 4.1565 4.1815 4.3482 3.8494 4.0493 3.9164 3.9105 4.1843 3.8024 3.8266 3.9090 3.9251 3.6992 3.9880 4.0919 3.9058 4.0039 1.0231 1.0169 1.0193 1.0460 0.9938 1.0280 1.0346 1.0405 1.0101 1.0340 1.0013 1.0344 0.9945 1.0077 1.0159 1.0082 1.0131 0.9979 1.0019 1.0231 1.0026 1.0268 1.0579 1.0601 1.0235 1.0310 1.0301 1.0190 1.0189 1.0287 1.0215 1.0187 1.0271 1.0293 1.0195 1.0188 1.0163 1.0038 1.0006
dispcorr: -0.053541931 hartree
energy: -2013.018637771746
dipole: 43.14118 -41.88375 1.25743 9.34542 -9.80557 -0.46015 -6.31021 6.13762 -0.17259
magnitude: 1.35006 au
magnitude: 3.43157 debye
