program: Orca
programVersion: 5.0.2
elementType: Cl Cl Cl Cl F F F O O O N C C C C C C C C C C C C C C C C C C H H H H H H H H H H H H H H
charge: 0
multiplicity: 1
keywords: wb97x-d3
keywords: def2-TZVPP
keywords: def2/J RIJCOSX
keywords: DEFGRID2
keywords: scfconv7
keywords: smallprint printgap noloewdin
keywords: NOSOSCF
formula: C18H14Cl4F3NO3
InChI: InChI=1/C18H14Cl4F3NO3/c19-13-8-12(27-7-4-15(21)22)9-14(20)17(13)29-6-1-5-28-16-3-2-11(10-26-16)18(23,24)25/h2-4,8-10H,1,5-7H2
43 atoms
Cl -2.157636 1.447616 3.02042
Cl 0.076133 3.125644 -1.574767
Cl 5.782392 1.454391 -0.023061
Cl 4.365851 0.230072 -2.210408
F  0.496147 -3.520005 -1.215892
F  0.337533 -3.928106 0.892965
F  -0.933949 -4.95228 -0.495171
O  -1.829319 3.241566 0.632981
O  -4.225354 0.193738 0.147749
O  1.576457 -1.082877 0.900813
N  -2.553942 -0.831478 -1.050719
C  -3.369807 2.185575 -1.021132
C  -3.199248 2.987542 0.269322
C  -4.447162 1.122572 -0.918222
C  -0.99908 2.177023 0.694178
C  -1.030201 1.242288 1.73018
C  -0.025081 1.988156 -0.281246
C  -3.280664 -0.739702 0.043364
C  0.790524 0.007165 0.778691
C  -0.158095 0.174728 1.783458
C  0.870563 0.929091 -0.257157
C  -3.132826 -1.604881 1.136892
C  -1.393545 -2.683894 -0.096711
C  -2.180339 -2.588074 1.055104
C  -1.621129 -1.777752 -1.112552
C  -0.37424 -3.760896 -0.229398
C  2.691996 -1.244374 0.041701
C  3.768719 -0.26031 0.370121
C  4.526799 0.382743 -0.503778
H  -3.645022 2.846531 -1.845083
H  -2.43898 1.707611 -1.321843
H  -3.708843 2.502526 1.103387
H  -3.636146 3.979344 0.168148
H  -4.552413 0.596258 -1.868205
H  -5.410946 1.572788 -0.681062
H  -0.206713 -0.531876 2.601136
H  1.59113 0.842345 -1.057492
H  -3.754021 -1.494889 2.014552
H  -2.049205 -3.272484 1.883411
H  -1.044562 -1.801838 -2.028781
H  2.396922 -1.216297 -1.009687
H  3.057288 -2.252008 0.244976
H  3.965061 -0.096682 1.423902
elementType: Cl F O N C H
totalener: -3115.25765102 hartree
nucrepener: 3753.30147647 hartree
electener: -6868.55912749 hartree
twoeener: 4895.34792538 hartree
cpcmener: -0.02599092 hartree
kineticenergy: 3107.70012675 hartree
xcener: -200.393617289594 hartree
chargesum: -0.0000000
charge: -0.078886 -0.074248 -0.048823 -0.050250 -0.186906 -0.189118 -0.185186 -0.365495 -0.313564 -0.331142 -0.376260 -0.130094 -0.016747 0.011428 0.151612 0.123420 -0.048565 0.406058 0.290447 -0.260794 -0.098552 -0.213926 -0.062455 -0.117054 -0.022362 0.579672 0.057979 -0.163135 0.050694 0.106178 0.069586 0.098736 0.115082 0.105530 0.126582 0.127390 0.114153 0.143480 0.153499 0.130981 0.103387 0.128528 0.139138
qa: -0.0789 -0.0742 -0.0488 -0.0502 -0.1869 -0.1891 -0.1852 -0.3655 -0.3136 -0.3311 -0.3763 -0.1301 -0.0167 0.0114 0.1516 0.1234 -0.0486 0.4061 0.2904 -0.2608 -0.0986 -0.2139 -0.0625 -0.1171 -0.0224 0.5797 0.0580 -0.1631 0.0507 0.1062 0.0696 0.0987 0.1151 0.1055 0.1266 0.1274 0.1142 0.1435 0.1535 0.1310 0.1034 0.1285 0.1391
va: 1.2316 1.2420 1.2535 1.2730 1.1111 1.1040 1.1056 2.0226 2.0867 2.0521 2.9639 3.7621 3.8448 3.8664 3.9640 3.7621 3.9790 3.8941 3.7796 4.0837 3.8723 3.9348 3.5301 3.9860 4.1094 4.3794 3.8882 3.8510 4.1729 1.0135 1.0398 1.0140 1.0034 1.0163 0.9919 1.0244 1.0371 1.0115 1.0060 1.0160 1.0081 0.9965 1.0192
dispcorr: -0.032133183 hartree
energy: -3115.289784204321
dipole: -29.11283 28.25914 -0.85370 6.31221 -7.04338 -0.73117 1.38061 -1.30023 0.08038
magnitude: 1.12689 au
magnitude: 2.86432 debye
