program: Orca
programVersion: 5.0.2
elementType: Cl Cl Cl Cl F F F O O O N C C C C C C C C C C C C C C C C C C H H H H H H H H H H H H H H
charge: 0
multiplicity: 1
keywords: wb97x-d3
keywords: def2-TZVPP
keywords: def2/J RIJCOSX
keywords: DEFGRID2
keywords: scfconv7
keywords: smallprint printgap noloewdin
keywords: NOSOSCF
formula: C18H14Cl4F3NO3
InChI: InChI=1/C18H14Cl4F3NO3/c19-13-8-12(27-7-4-15(21)22)9-14(20)17(13)29-6-1-5-28-16-3-2-11(10-26-16)18(23,24)25/h2-4,8-10H,1,5-7H2
43 atoms
Cl -1.804992 2.632561 -2.874007
Cl -1.870187 3.221005 2.475664
Cl 5.681527 -2.297079 -0.341934
Cl 3.731442 -2.260784 -2.468228
F  1.781084 -2.172167 2.049823
F  0.623332 -3.978152 2.079478
F  1.428576 -3.253563 0.218556
O  -2.93336 3.504689 -0.337601
O  -3.672249 0.181915 0.535734
O  1.722018 0.613363 0.210692
N  -1.993688 -1.118687 -0.317677
C  -4.801642 1.884296 -0.699506
C  -4.175957 2.977492 0.148403
C  -4.045154 0.572416 -0.78537
C  -1.802814 2.785403 -0.193728
C  -1.132059 2.309341 -1.316489
C  -1.187211 2.548064 1.038552
C  -2.600826 -0.581913 0.717422
C  0.599456 1.325964 0.006155
C  0.051607 1.590462 -1.242684
C  -0.017201 1.825183 1.150021
C  -2.174618 -0.769763 2.040779
C  -0.377732 -2.070138 1.1490
C  -1.04819 -1.522144 2.247973
C  -0.898442 -1.842774 -0.108104
C  0.859727 -2.866634 1.364581
C  2.4296 0.120998 -0.911163
C  3.640268 -0.570072 -0.382215
C  4.260314 -1.572611 -0.982787
H  -5.791496 1.709281 -0.267753
H  -4.971007 2.237804 -1.718975
H  -4.079678 2.644712 1.182043
H  -4.845705 3.83678 0.154963
H  -3.166391 0.657188 -1.420816
H  -4.680545 -0.199513 -1.228245
H  0.509121 1.241126 -2.157546
H  0.428032 1.649661 2.120562
H  -2.710727 -0.318041 2.863919
H  -0.6864 -1.674479 3.257132
H  -0.432626 -2.25186 -0.996616
H  2.734584 0.947183 -1.566632
H  1.802719 -0.553755 -1.502594
H  4.06564 -0.185877 0.537347
elementType: Cl F O N C H
totalener: -3115.27336815 hartree
nucrepener: 3750.47200784 hartree
electener: -6865.74537599 hartree
twoeener: 4892.32082261 hartree
cpcmener: -0.02294154 hartree
kineticenergy: 3107.71193002 hartree
xcener: -200.395155425405 hartree
chargesum: 0.0000000
charge: -0.078476 -0.075783 -0.051236 -0.052816 -0.188060 -0.184590 -0.184718 -0.351833 -0.302017 -0.311719 -0.362902 -0.137092 0.000795 -0.007397 0.176570 -0.001831 0.088171 0.385895 0.274253 -0.146691 -0.258414 -0.202933 -0.068128 -0.115115 -0.017254 0.588262 0.075348 -0.196720 0.060644 0.087542 0.080596 0.097867 0.112181 0.098167 0.122924 0.117851 0.123782 0.139706 0.153153 0.128961 0.147539 0.101816 0.133702
qa: -0.0785 -0.0758 -0.0512 -0.0528 -0.1881 -0.1846 -0.1847 -0.3518 -0.3020 -0.3117 -0.3629 -0.1371 0.0008 -0.0074 0.1766 -0.0018 0.0882 0.3859 0.2743 -0.1467 -0.2584 -0.2029 -0.0681 -0.1151 -0.0173 0.5883 0.0753 -0.1967 0.0606 0.0875 0.0806 0.0979 0.1122 0.0982 0.1229 0.1179 0.1238 0.1397 0.1532 0.1290 0.1475 0.1018 0.1337
va: 1.2366 1.2359 1.2499 1.2692 1.1018 1.1120 1.1176 2.0449 2.0954 2.0587 2.9921 3.8610 3.8745 3.8146 3.9055 3.9308 3.7833 3.9318 3.8525 3.9226 4.0583 3.9399 3.5457 3.9900 4.0756 4.3688 3.8067 3.8784 4.2075 1.0176 1.0191 1.0170 1.0010 1.0255 1.0046 1.0333 1.0284 1.0101 1.0055 1.0171 0.9840 0.9963 1.0241
dispcorr: -0.032172425 hartree
energy: -3115.305540574999
dipole: -31.80083 30.88299 -0.91783 16.12820 -15.80577 0.32243 -0.50841 0.62496 0.11655
magnitude: 0.97978 au
magnitude: 2.49040 debye
