program: Orca
programVersion: 5.0.2
elementType: Cl Cl Cl Cl F F F O O O N C C C C C C C C C C C C C C C C C C H H H H H H H H H H H H H H
charge: 0
multiplicity: 1
keywords: wb97x-d3
keywords: def2-TZVPP
keywords: def2/J RIJCOSX
keywords: DEFGRID2
keywords: scfconv7
keywords: smallprint printgap noloewdin
keywords: NOSOSCF
formula: C18H14Cl4F3NO3
InChI: InChI=1/C18H14Cl4F3NO3/c19-13-8-12(27-7-4-15(21)22)9-14(20)17(13)29-6-1-5-28-16-3-2-11(10-26-16)18(23,24)25/h2-4,8-10H,1,5-7H2
43 atoms
Cl -2.505005 3.331768 2.626997
Cl -0.423896 2.825101 -2.310912
Cl 3.138113 -2.264072 -1.801949
Cl 4.049789 0.46476 -1.846713
F  1.393022 -3.773086 0.695234
F  -0.400687 -4.895139 1.059492
F  0.442611 -4.8130 -0.923125
O  -2.436727 3.735158 -0.248694
O  -2.891164 0.387329 -0.84399
O  1.793653 0.910045 1.855239
N  -2.304895 -1.326046 0.549551
C  -4.380255 2.175349 -0.341792
C  -3.45114 3.145795 -1.056061
C  -3.762812 0.882181 0.165922
C  -1.41088 2.987871 0.196765
C  -1.284457 2.73671 1.566116
C  -0.392224 2.503666 -0.615604
C  -2.141188 -0.674861 -0.580898
C  0.778054 1.562202 1.251661
C  -0.217584 2.042391 2.096677
C  0.688582 1.791654 -0.113811
C  -1.206186 -1.051532 -1.554708
C  -0.626152 -2.881245 -0.125683
C  -0.451207 -2.171801 -1.317464
C  -1.561851 -2.402605 0.772951
C  0.194278 -4.091646 0.174542
C  2.956785 0.614348 1.116925
C  2.80145 -0.61688 0.279101
C  3.263838 -0.777694 -0.952197
H  -4.866884 2.668982 0.502236
H  -5.171779 1.940898 -1.060038
H  -4.040548 3.994957 -1.401595
H  -3.023396 2.673329 -1.940674
H  -4.546493 0.151047 0.38198
H  -3.214983 1.032281 1.096146
H  -0.148575 1.874382 3.162346
H  1.437421 1.442435 -0.809032
H  -1.09543 -0.469796 -2.458981
H  0.268687 -2.494992 -2.056192
H  -1.741459 -2.904392 1.716299
H  3.727332 0.427287 1.86851
H  3.285937 1.475154 0.527823
H  2.31288 -1.461509 0.748216
totalener: -3115.25090451 hartree
nucrepener: 3771.45091817 hartree
electener: -6886.70182269 hartree
twoeener: 4912.80154695 hartree
kineticenergy: 3107.75803389 hartree
xcener: -200.403177546199 hartree
chargesum: 0.0000000
charge: -0.062960 -0.063139 -0.032901 -0.041864 -0.175188 -0.170963 -0.172100 -0.311842 -0.271098 -0.286199 -0.327804 -0.156235 -0.000440 -0.018023 0.192949 0.024079 -0.065309 0.372647 0.293497 -0.202362 -0.094441 -0.176534 -0.079977 -0.143032 -0.021062 0.555411 0.040342 -0.166213 0.050557 0.082964 0.079077 0.100780 0.095795 0.113483 0.113576 0.114809 0.087636 0.122891 0.142379 0.116963 0.111294 0.097667 0.130890
qa: -0.0630 -0.0631 -0.0329 -0.0419 -0.1752 -0.1710 -0.1721 -0.3118 -0.2711 -0.2862 -0.3278 -0.1562 -0.0004 -0.0180 0.1929 0.0241 -0.0653 0.3726 0.2935 -0.2024 -0.0944 -0.1765 -0.0800 -0.1430 -0.0211 0.5554 0.0403 -0.1662 0.0506 0.0830 0.0791 0.1008 0.0958 0.1135 0.1136 0.1148 0.0876 0.1229 0.1424 0.1170 0.1113 0.0977 0.1309
va: 1.2504 1.2540 1.2789 1.2789 1.0982 1.1341 1.1279 2.0842 2.1143 2.1145 3.0057 3.8655 3.8934 3.8134 3.8726 3.9396 4.0042 3.9711 3.8415 4.1353 3.7946 3.9509 3.6283 3.9738 4.1570 4.4037 3.9386 3.7473 4.1415 1.0175 1.0177 1.0003 1.0144 1.0108 1.0125 1.0305 1.0515 1.0208 1.0191 1.0134 0.9932 1.0141 1.0305
dispcorr: -0.031657721 hartree
energy: -3115.282562235050
dipole: -22.37509 22.29369 -0.08140 16.00822 -15.83166 0.17657 4.70080 -4.89041 -0.18961
magnitude: 0.27158 au
magnitude: 0.69029 debye
