program: Orca
programVersion: 5.0.2
elementType: Cl Cl Cl Cl F F F O O O N C C C C C C C C C C C C C C C C C C H H H H H H H H H H H H H H
charge: 0
multiplicity: 1
keywords: wb97x-d3
keywords: def2-TZVPP
keywords: def2/J RIJCOSX
keywords: DEFGRID2
keywords: scfconv7
keywords: smallprint printgap noloewdin
keywords: NOSOSCF
formula: C18H14Cl4F3NO3
InChI: InChI=1/C18H14Cl4F3NO3/c19-13-8-12(27-7-4-15(21)22)9-14(20)17(13)29-6-1-5-28-16-3-2-11(10-26-16)18(23,24)25/h2-4,8-10H,1,5-7H2
43 atoms
Cl -2.199763 1.438272 2.989623
Cl 0.080054 3.124012 -1.579483
Cl 5.79777 1.396635 -0.025356
Cl 4.289279 0.263217 -2.201613
F  0.51388 -3.491144 -1.232184
F  0.345954 -3.947421 0.86865
F  -0.929077 -4.929605 -0.547822
O  -1.835377 3.241318 0.607533
O  -4.199804 0.208091 0.188387
O  1.564681 -1.076337 0.91779
N  -2.530127 -0.798474 -1.013267
C  -3.382251 2.181082 -1.032157
C  -3.198011 3.002912 0.248102
C  -4.439449 1.098365 -0.899177
C  -1.013383 2.178711 0.679375
C  -1.05415 1.244245 1.715948
C  -0.027994 1.992539 -0.285831
C  -3.258931 -0.724406 0.078086
C  0.782286 0.014298 0.786338
C  -0.179607 0.179296 1.777183
C  0.871836 0.937043 -0.247021
C  -3.106267 -1.603694 1.160385
C  -1.371728 -2.670338 -0.097354
C  -2.154102 -2.58538 1.057692
C  -1.605008 -1.746618 -1.096979
C  -0.359102 -3.754417 -0.251233
C  2.665995 -1.252918 0.056114
C  3.77151 -0.296989 0.37689
C  4.515855 0.361293 -0.498897
H  -3.674661 2.829181 -1.861644
H  -2.450585 1.711697 -1.344332
H  -3.720848 2.535203 1.085179
H  -3.618188 4.000748 0.129966
H  -4.522706 0.542253 -1.835431
H  -5.415632 1.531395 -0.676237
H  -0.23591 -0.527735 2.592767
H  1.61034 0.861698 -1.031936
H  -3.723094 -1.497799 2.041101
H  -2.013469 -3.28079 1.875102
H  -1.029855 -1.755249 -2.014623
H  2.372759 -1.204342 -0.995835
H  3.003882 -2.273603 0.243614
H  3.998023 -0.159766 1.427652
totalener: -3115.24785989 hartree
nucrepener: 3763.83433571 hartree
electener: -6879.08219560 hartree
twoeener: 4905.56177819 hartree
kineticenergy: 3107.76465597 hartree
xcener: -200.405430594073 hartree
chargesum: -0.0000000
charge: -0.068789 -0.056192 -0.028504 -0.038923 -0.186550 -0.177881 -0.168722 -0.312345 -0.270004 -0.291215 -0.339112 -0.152791 -0.021990 -0.001710 0.151232 0.122066 -0.062814 0.378045 0.260105 -0.243722 -0.078805 -0.200696 -0.052771 -0.116907 -0.036010 0.568677 0.041273 -0.184926 0.070365 0.092648 0.093803 0.096955 0.095251 0.101470 0.115105 0.114600 0.088878 0.127802 0.130350 0.115329 0.090858 0.115467 0.121100
qa: -0.0688 -0.0562 -0.0285 -0.0389 -0.1865 -0.1779 -0.1687 -0.3123 -0.2700 -0.2912 -0.3391 -0.1528 -0.0220 -0.0017 0.1512 0.1221 -0.0628 0.3780 0.2601 -0.2437 -0.0788 -0.2007 -0.0528 -0.1169 -0.0360 0.5687 0.0413 -0.1849 0.0704 0.0926 0.0938 0.0970 0.0953 0.1015 0.1151 0.1146 0.0889 0.1278 0.1303 0.1153 0.0909 0.1155 0.1211
va: 1.2431 1.2619 1.2745 1.2866 1.1113 1.1194 1.1283 2.0771 2.1216 2.0839 2.9727 3.7716 3.8843 3.8754 3.9617 3.7869 4.0662 3.9591 3.8204 4.0663 3.8685 3.9531 3.5751 4.0021 4.1289 4.3871 3.9194 3.8576 4.1791 1.0147 1.0330 1.0094 1.0033 1.0178 0.9902 1.0287 1.0544 1.0185 1.0135 1.0167 1.0139 0.9979 1.0265
dispcorr: -0.032395011 hartree
energy: -3115.280254902266
dipole: -28.96970 28.35938 -0.61032 6.26342 -6.58906 -0.32564 1.52661 -1.49339 0.03322
magnitude: 0.69256 au
magnitude: 1.76034 debye
