program: Orca
programVersion: 5.0.2
elementType: Cl Cl Cl Cl F F F O O O N C C C C C C C C C C C C C C C C C C H H H H H H H H H H H H H H
charge: 0
multiplicity: 1
keywords: wb97x-d3
keywords: def2-TZVPP
keywords: def2/J RIJCOSX
keywords: DEFGRID2
keywords: scfconv7
keywords: smallprint printgap noloewdin
keywords: NOSOSCF
formula: C18H14Cl4F3NO3
InChI: InChI=1/C18H14Cl4F3NO3/c19-13-8-12(27-7-4-15(21)22)9-14(20)17(13)29-6-1-5-28-16-3-2-11(10-26-16)18(23,24)25/h2-4,8-10H,1,5-7H2
43 atoms
Cl -0.489508 2.847151 -2.093016
Cl -1.695927 2.02035 3.090524
Cl 5.511046 1.423088 -1.512363
Cl 3.622352 -0.091694 -3.073836
F  0.703715 -4.042702 0.096383
F  0.376681 -3.90965 2.224971
F  -0.887865 -5.15535 1.018819
O  -1.914187 3.368085 0.382954
O  -3.613696 0.33141 0.221404
O  1.660732 -0.810166 0.752112
N  -2.115582 -1.185876 -0.609432
C  -3.964926 2.490844 -0.731851
C  -3.320828 3.156472 0.475236
C  -3.553649 1.054095 -1.004956
C  -1.063487 2.329191 0.476565
C  -0.277102 1.979903 -0.618474
C  -0.841303 1.605759 1.650592
C  -2.826453 -0.724706 0.394601
C  0.824258 0.237882 0.595131
C  0.662855 0.960815 -0.578924
C  0.074263 0.575036 1.715793
C  -2.796871 -1.290857 1.677308
C  -1.168723 -2.829003 0.836331
C  -1.956057 -2.353297 1.888886
C  -1.301789 -2.210894 -0.391243
C  -0.243701 -3.981063 1.041662
C  2.557201 -1.145434 -0.281614
C  3.670803 -0.151369 -0.386386
C  4.194087 0.325314 -1.505753
H  -5.04476 2.538775 -0.56045
H  -3.769793 3.072754 -1.63545
H  -3.580262 2.611646 1.383381
H  -3.733454 4.159932 0.578622
H  -2.555634 0.998221 -1.434176
H  -4.232789 0.59778 -1.730979
H  1.228038 0.750196 -1.475162
H  0.21217 0.027151 2.637362
H  -3.402409 -0.877102 2.470989
H  -1.897531 -2.80047 2.872602
H  -0.731608 -2.543197 -1.250714
H  2.042365 -1.28736 -1.236324
H  2.964795 -2.115931 0.006533
H  4.106678 0.179631 0.548809
totalener: -3115.24968497 hartree
nucrepener: 3756.82181827 hartree
electener: -6872.07150324 hartree
twoeener: 4898.39222622 hartree
kineticenergy: 3107.75557476 hartree
xcener: -200.405598262969 hartree
chargesum: -0.0000000
charge: -0.061318 -0.068204 -0.028318 -0.039317 -0.183815 -0.177499 -0.169218 -0.310960 -0.279672 -0.291664 -0.318305 -0.145994 -0.008003 -0.017964 0.166745 -0.059081 0.092131 0.361181 0.236286 -0.060556 -0.211792 -0.192330 -0.046611 -0.105888 -0.038491 0.556565 0.046560 -0.184383 0.069937 0.077741 0.081078 0.097585 0.100565 0.114193 0.110763 0.084898 0.114143 0.122851 0.130777 0.115383 0.085688 0.113940 0.120375
qa: -0.0613 -0.0682 -0.0283 -0.0393 -0.1838 -0.1775 -0.1692 -0.3110 -0.2797 -0.2917 -0.3183 -0.1460 -0.0080 -0.0180 0.1667 -0.0591 0.0921 0.3612 0.2363 -0.0606 -0.2118 -0.1923 -0.0466 -0.1059 -0.0385 0.5566 0.0466 -0.1844 0.0699 0.0777 0.0811 0.0976 0.1006 0.1142 0.1108 0.0849 0.1141 0.1229 0.1308 0.1154 0.0857 0.1139 0.1204
va: 1.2572 1.2453 1.2746 1.2861 1.1149 1.1216 1.1272 2.0868 2.1127 2.0784 3.0069 3.8577 3.9047 3.8297 3.9010 4.0696 3.7937 3.9811 3.8215 3.9085 4.0251 3.9484 3.5738 3.9998 4.1085 4.4040 3.9225 3.8583 4.1764 1.0183 1.0181 1.0158 1.0014 1.0192 1.0052 1.0530 1.0296 1.0198 1.0129 1.0144 1.0103 0.9991 1.0267
dispcorr: -0.032563282 hartree
energy: -3115.282248256143
dipole: -26.86918 26.32853 -0.54065 8.78216 -8.83860 -0.05644 2.70092 -2.59316 0.10776
magnitude: 0.55417 au
magnitude: 1.40859 debye
