program: Orca
programVersion: 5.0.2
elementType: S S F F F O O O O O N N C C C C C C C C C C C C C C C H H H H H H H H H H H
charge: 0
multiplicity: 1
keywords: wb97x-d3
keywords: def2-TZVPP
keywords: def2/J RIJCOSX
keywords: DEFGRID2
keywords: scfconv7
keywords: smallprint printgap noloewdin
keywords: NOSOSCF
formula: C15H11F3N2O5S2
InChI: InChI=1/C15H11F3N2O5S2/c1-2-26(21,22)12-4-3-7-19-13(12)14-20-10-8-9(5-6-11(10)25-14)27(23,24)15(16,17)18/h3-8H,2H2,1H3
38 atoms
S  3.827201 -1.4496 -0.574449
S  -4.347995 -0.724867 0.230654
F  -4.919352 1.661098 -0.676908
F  -6.368394 0.830001 0.693131
F  -4.485699 1.589188 1.43469
O  1.191124 0.492183 -0.824465
O  5.001594 -2.272887 -0.289776
O  2.507827 -1.983253 -0.236435
O  -5.023697 -1.309262 -0.914182
O  -4.43833 -1.33753 1.544531
N  0.627536 0.335405 1.327007
N  3.138231 1.912618 1.545766
C  4.041094 0.07607 0.327105
C  2.970531 0.846214 0.77718
C  -0.488575 0.108791 0.547367
C  3.857577 -0.996086 -2.303451
C  -2.675811 -0.359591 -0.157716
C  -0.126979 0.206777 -0.792599
C  1.564044 0.53224 0.476426
C  -1.792512 -0.184967 0.899227
C  -2.306461 -0.252547 -1.505568
C  -0.998324 0.036059 -1.849354
C  5.329329 0.448865 0.684075
C  5.173254 -0.383921 -2.735441
C  -5.080282 0.964318 0.433651
C  5.498931 1.576107 1.465099
C  4.37225 2.266894 1.877718
H  3.653079 -1.932069 -2.830316
H  3.0172 -0.324358 -2.473165
H  -2.086678 -0.278438 1.935576
H  -3.033236 -0.405866 -2.290877
H  -0.688346 0.115847 -2.881476
H  6.187131 -0.130477 0.371451
H  5.374026 0.559704 -2.229542
H  5.117636 -0.174534 -3.802781
H  6.011184 -1.058847 -2.573611
H  6.484377 1.902868 1.763265
H  4.466019 3.141858 2.507811
elementType: S F O N C H
totalener: -2159.91973648 hartree
nucrepener: 2942.35771768 hartree
electener: -5102.27745417 hartree
oneelecener: -8821.94178695 hartree
twoeener: 3719.66433279 hartree
cpcmener: -0.05365629 hartree
kineticenergy: 2153.06574250 hartree
xcener: -159.739351150049 hartree
chargesum: -0.0000000
charge: 0.871817 0.831030 -0.139590 -0.139010 -0.139497 -0.240269 -0.557280 -0.552358 -0.503502 -0.503745 -0.306064 -0.359171 -0.127037 0.164122 0.163498 -0.099080 -0.004285 0.212103 0.398265 -0.229904 -0.061912 -0.206500 -0.053937 -0.278613 0.422735 -0.120367 0.036051 0.127625 0.128818 0.150704 0.154521 0.165616 0.157157 0.104388 0.113440 0.103490 0.167848 0.148896
qa: 0.8718 0.8310 -0.1396 -0.1390 -0.1395 -0.2403 -0.5573 -0.5524 -0.5035 -0.5037 -0.3061 -0.3592 -0.1270 0.1641 0.1635 -0.0991 -0.0043 0.2121 0.3983 -0.2299 -0.0619 -0.2065 -0.0539 -0.2786 0.4227 -0.1204 0.0361 0.1276 0.1288 0.1507 0.1545 0.1656 0.1572 0.1044 0.1134 0.1035 0.1678 0.1489
va: 5.5074 5.5758 1.1804 1.1814 1.1811 2.2979 1.9209 1.9130 1.9951 1.9907 3.1442 3.0846 3.8333 3.7867 3.9172 3.8318 3.7307 3.7718 3.8787 4.2254 3.9569 4.0100 3.9408 3.9522 4.4340 3.9266 4.0322 1.0154 1.0218 1.0230 1.0101 0.9960 1.0076 0.9952 1.0009 1.0109 0.9882 0.9958
dispcorr: -0.020719368 hartree
energy: -2159.940455852584
dipole: 47.16600 -42.90385 4.26215 -2.41477 5.62113 3.20635 -13.24629 10.59339 -2.65290
magnitude: 5.95689 au
magnitude: 15.14120 debye
