program: Orca
programVersion: 5.0.2
elementType: S S F F F O O O O O N N C C C C C C C C C C C C C C C H H H H H H H H H H H
charge: 0
multiplicity: 1
keywords: wb97x-d3
keywords: def2-TZVPP
keywords: def2/J RIJCOSX
keywords: DEFGRID2
keywords: scfconv7
keywords: smallprint printgap noloewdin
keywords: NOSOSCF
formula: C15H11F3N2O5S2
InChI: InChI=1/C15H11F3N2O5S2/c1-2-26(21,22)12-4-3-7-19-13(12)14-20-10-8-9(5-6-11(10)25-14)27(23,24)15(16,17)18/h3-8H,2H2,1H3
38 atoms
S  3.199234 -1.565591 -0.354526
S  -4.3335 0.660022 0.231703
F  -5.582143 -1.6084 0.434908
F  -4.258806 -1.477815 -1.268416
F  -3.446078 -1.755818 0.709122
O  1.199576 1.39455 -1.197212
O  1.775231 -1.387792 -0.637805
O  4.035563 -2.19123 -1.376708
O  -4.516554 0.884265 1.654589
O  -5.269518 1.203594 -0.736543
N  0.807652 1.060203 0.975207
N  3.701798 2.362496 0.44829
C  3.909575 0.031824 0.006842
C  3.15421 1.184804 0.184464
C  -0.396427 1.110565 0.297802
C  3.394786 -2.47068 1.17731
C  -2.677721 0.999359 -0.237184
C  -0.139969 1.32247 -1.053478
C  1.683664 1.194969 0.053102
C  -1.694083 0.939154 0.742517
C  -2.412742 1.237502 -1.592316
C  -1.11276 1.413454 -2.027804
C  5.292305 0.113264 0.105517
C  2.596555 -1.885026 2.321423
C  -4.40794 -1.179743 0.00992
C  5.859208 1.340326 0.386564
C  5.022491 2.432573 0.551582
H  3.081675 -3.490419 0.9386
H  4.465408 -2.489272 1.387373
H  -1.911968 0.760053 1.786774
H  -3.218548 1.287337 -2.311182
H  -0.882205 1.592815 -3.068068
H  5.918868 -0.758468 -0.031685
H  2.790329 -2.479049 3.21334
H  1.526601 -1.916811 2.128469
H  2.888201 -0.859425 2.544803
H  6.930353 1.451598 0.472144
H  5.434742 3.408869 0.771147
elementType: S F O N C H
totalener: -2159.91700597 hartree
nucrepener: 2985.76521006 hartree
electener: -5145.68221602 hartree
oneelecener: -8909.45618369 hartree
twoeener: 3763.77396766 hartree
cpcmener: -0.05018417 hartree
kineticenergy: 2153.05801454 hartree
xcener: -159.736754789395 hartree
chargesum: 0.0000000
charge: 0.865873 0.829733 -0.138822 -0.139917 -0.139684 -0.228255 -0.544464 -0.557482 -0.505157 -0.502342 -0.302398 -0.347771 -0.127469 0.162572 0.178238 -0.097438 -0.001178 0.197818 0.410290 -0.248723 -0.061437 -0.208288 -0.059012 -0.273816 0.422455 -0.131254 0.038481 0.129787 0.128385 0.152423 0.155891 0.161927 0.148616 0.115181 0.097028 0.103360 0.166909 0.149940
qa: 0.8659 0.8297 -0.1388 -0.1399 -0.1397 -0.2283 -0.5445 -0.5575 -0.5052 -0.5023 -0.3024 -0.3478 -0.1275 0.1626 0.1782 -0.0974 -0.0012 0.1978 0.4103 -0.2487 -0.0614 -0.2083 -0.0590 -0.2738 0.4225 -0.1313 0.0385 0.1298 0.1284 0.1524 0.1559 0.1619 0.1486 0.1152 0.0970 0.1034 0.1669 0.1499
va: 5.5096 5.5760 1.1819 1.1808 1.1787 2.3020 1.9265 1.9205 1.9904 1.9947 3.1108 3.0717 3.8554 3.7854 3.8497 3.8324 3.7262 3.7961 3.8738 4.2105 3.9580 4.0344 3.9833 3.9453 4.4301 3.9347 4.0265 1.0156 1.0118 1.0223 1.0090 0.9977 1.0085 1.0026 1.0121 1.0010 0.9887 0.9949
dispcorr: -0.021189812 hartree
energy: -2159.938195778127
dipole: 38.14369 -33.18992 4.95378 0.97665 -1.20713 -0.23048 7.51295 -6.73975 0.77321
magnitude: 5.01905 au
magnitude: 12.75741 debye
