program: Orca
programVersion: 5.0.2
elementType: S S F F F O O O O O N N C C C C C C C C C C C C C C C H H H H H H H H H H H
charge: 0
multiplicity: 1
keywords: wb97x-d3
keywords: def2-TZVPP
keywords: def2/J RIJCOSX
keywords: DEFGRID2
keywords: scfconv7
keywords: smallprint printgap noloewdin
keywords: NOSOSCF
formula: C15H11F3N2O5S2
InChI: InChI=1/C15H11F3N2O5S2/c1-2-26(21,22)12-4-3-7-19-13(12)14-20-10-8-9(5-6-11(10)25-14)27(23,24)15(16,17)18/h3-8H,2H2,1H3
38 atoms
S  3.196775 -0.56021 1.634389
S  -4.181097 -0.199501 -1.152466
F  -3.556484 -1.798351 0.814477
F  -4.316673 0.12316 1.433343
F  -5.664493 -1.365803 0.636335
O  1.12999 1.983135 -0.571753
O  4.210169 -0.697909 2.67922
O  1.992906 0.213846 1.941236
O  -5.194463 0.8233 -1.337842
O  -4.127807 -1.36757 -2.014231
N  1.030932 -0.186195 -1.076506
N  3.820107 1.519384 -1.754474
C  3.982506 0.211854 0.230916
C  3.250109 0.850043 -0.764891
C  -0.253237 0.318406 -1.00233
C  2.74106 -2.194735 1.070787
C  -2.588651 0.525617 -1.003974
C  -0.179337 1.671427 -0.68663
C  1.777089 0.81717 -0.802276
C  -1.480523 -0.293442 -1.178171
C  -2.506822 1.886929 -0.682041
C  -1.275113 2.494087 -0.523823
C  5.36726 0.250274 0.174244
C  1.912192 -2.907158 2.12345
C  -4.448024 -0.858146 0.558202
C  5.95999 0.932039 -0.872582
C  5.146165 1.557551 -1.8024
H  2.19272 -2.074906 0.137235
H  3.677114 -2.713979 0.860744
H  -1.556426 -1.341224 -1.435471
H  -3.402554 2.479959 -0.562694
H  -1.186743 3.543627 -0.282953
H  5.97261 -0.22929 0.931024
H  2.448768 -3.017997 3.064291
H  1.679042 -3.905261 1.756186
H  0.969968 -2.395633 2.310882
H  7.035217 0.989989 -0.95916
H  5.579554 2.112884 -2.623994
elementType: S F O N C H
totalener: -2159.91797654 hartree
nucrepener: 2974.06483650 hartree
electener: -5133.98281305 hartree
oneelecener: -8885.52301559 hartree
twoeener: 3751.54020254 hartree
cpcmener: -0.04509231 hartree
kineticenergy: 2153.06664429 hartree
xcener: -159.738889200009 hartree
chargesum: 0.0000000
charge: 0.870579 0.830238 -0.139347 -0.139345 -0.138575 -0.227341 -0.559350 -0.551501 -0.502833 -0.502556 -0.333179 -0.353451 -0.102927 0.163738 0.159834 -0.126575 -0.011368 0.211921 0.398528 -0.232388 -0.053869 -0.206926 -0.051634 -0.259871 0.422340 -0.118474 0.035184 0.135545 0.133980 0.152642 0.156098 0.162514 0.154694 0.099694 0.106356 0.100086 0.167932 0.149610
qa: 0.8706 0.8302 -0.1393 -0.1393 -0.1386 -0.2273 -0.5594 -0.5515 -0.5028 -0.5026 -0.3332 -0.3535 -0.1029 0.1637 0.1598 -0.1266 -0.0114 0.2119 0.3985 -0.2324 -0.0539 -0.2069 -0.0516 -0.2599 0.4223 -0.1185 0.0352 0.1355 0.1340 0.1526 0.1561 0.1625 0.1547 0.0997 0.1064 0.1001 0.1679 0.1496
va: 5.4814 5.5751 1.1813 1.1797 1.1826 2.3173 1.9192 1.8977 1.9960 1.9918 3.0713 3.0650 3.8580 3.8109 3.8716 3.8141 3.7414 3.7989 3.8293 4.2117 3.9433 4.0275 3.9716 3.9472 4.4314 3.9172 4.0276 1.0243 1.0140 1.0220 1.0091 0.9973 1.0132 1.0106 1.0004 1.0105 0.9884 0.9957
dispcorr: -0.020494328 hartree
energy: -2159.938470871736
dipole: 34.89055 -31.10821 3.78234 -3.43726 3.40523 -0.03203 0.61370 -1.17580 -0.56210
magnitude: 3.82401 au
magnitude: 9.71987 debye
