program: Orca
programVersion: 5.0.2
elementType: S S F F F O O O O O N N C C C C C C C C C C C C C C C H H H H H H H H H H H
charge: 0
multiplicity: 1
keywords: wb97x-d3
keywords: def2-TZVPP
keywords: def2/J RIJCOSX
keywords: DEFGRID2
keywords: scfconv7
keywords: smallprint printgap noloewdin
keywords: NOSOSCF
formula: C15H11F3N2O5S2
InChI: InChI=1/C15H11F3N2O5S2/c1-2-26(21,22)12-4-3-7-19-13(12)14-20-10-8-9(5-6-11(10)25-14)27(23,24)15(16,17)18/h3-8H,2H2,1H3
38 atoms
S  3.139652 -1.58744 -0.243404
S  -4.303201 0.513378 0.441318
F  -3.499715 -1.961057 0.254003
F  -5.625481 -1.674575 -0.010564
F  -4.254215 -1.132645 -1.588419
O  1.117756 1.763817 -1.072914
O  1.950336 -1.378716 -1.069519
O  4.183752 -2.477841 -0.748376
O  -4.380272 0.325596 1.879271
O  -5.289052 1.309801 -0.266787
N  0.880696 0.719548 0.883194
N  3.72353 2.383094 0.131683
C  3.900851 0.007526 0.020858
C  3.161891 1.186242 0.057694
C  -0.368067 0.951764 0.341206
C  2.64419 -2.150387 1.37724
C  -2.68105 0.979458 -0.034873
C  -0.20919 1.604325 -0.877376
C  1.690813 1.187523 0.009852
C  -1.629813 0.621512 0.798532
C  -2.514308 1.644035 -1.257234
C  -1.249524 1.98053 -1.701711
C  5.283877 0.084855 0.094689
C  3.813168 -2.348884 2.318698
C  -4.427978 -1.187494 -0.280169
C  5.86659 1.334279 0.20137
C  5.046853 2.45052 0.20385
H  1.927718 -1.420567 1.75321
H  2.109481 -3.085095 1.18764
H  -1.770365 0.113536 1.742864
H  -3.369579 1.906058 -1.86387
H  -1.096487 2.492738 -2.640672
H  5.897944 -0.804441 0.062771
H  4.522434 -3.083192 1.942275
H  3.427852 -2.717011 3.268405
H  4.341509 -1.41779 2.520759
H  6.939492 1.442726 0.265465
H  5.47383 3.443087 0.265683
elementType: S F O N C H
totalener: -2159.91839616 hartree
nucrepener: 2974.45628930 hartree
electener: -5134.37468547 hartree
oneelecener: -8886.36570110 hartree
twoeener: 3751.99101564 hartree
cpcmener: -0.04545776 hartree
kineticenergy: 2153.08141022 hartree
xcener: -159.743004298685 hartree
chargesum: -0.0000000
charge: 0.875621 0.829761 -0.139511 -0.138852 -0.139643 -0.228404 -0.553579 -0.558621 -0.503302 -0.502860 -0.333557 -0.356230 -0.152298 0.185801 0.163493 -0.105672 -0.007189 0.212957 0.410545 -0.233375 -0.056704 -0.209553 -0.046693 -0.276983 0.422733 -0.119868 0.034932 0.133041 0.127404 0.154098 0.156336 0.163197 0.157773 0.101203 0.112702 0.104738 0.167702 0.148857
qa: 0.8756 0.8298 -0.1395 -0.1389 -0.1396 -0.2284 -0.5536 -0.5586 -0.5033 -0.5029 -0.3336 -0.3562 -0.1523 0.1858 0.1635 -0.1057 -0.0072 0.2130 0.4105 -0.2334 -0.0567 -0.2096 -0.0467 -0.2770 0.4227 -0.1199 0.0349 0.1330 0.1274 0.1541 0.1563 0.1632 0.1578 0.1012 0.1127 0.1047 0.1677 0.1489
va: 5.4994 5.5780 1.1803 1.1820 1.1806 2.3196 1.9117 1.9199 1.9922 1.9956 3.0746 3.0643 3.8781 3.7849 3.8581 3.8144 3.7391 3.8090 3.8258 4.2013 3.9467 4.0335 3.9321 3.9569 4.4319 3.9243 4.0343 1.0312 1.0161 1.0212 1.0090 0.9971 1.0091 1.0117 1.0003 0.9955 0.9883 0.9958
dispcorr: -0.020855148 hartree
energy: -2159.939251311542
dipole: 39.37177 -35.37482 3.99695 1.37522 -0.65868 0.71654 9.23441 -8.49217 0.74224
magnitude: 4.12795 au
magnitude: 10.49242 debye
