program: Orca
programVersion: 5.0.2
elementType: S S F F F O O O O O N N C C C C C C C C C C C C C C C H H H H H H H H H H H
charge: 0
multiplicity: 1
keywords: wb97x-d3
keywords: def2-TZVPP
keywords: def2/J RIJCOSX
keywords: DEFGRID2
keywords: scfconv7
keywords: smallprint printgap noloewdin
keywords: NOSOSCF
formula: C15H11F3N2O5S2
InChI: InChI=1/C15H11F3N2O5S2/c1-2-26(21,22)12-4-3-7-19-13(12)14-20-10-8-9(5-6-11(10)25-14)27(23,24)15(16,17)18/h3-8H,2H2,1H3
38 atoms
S  3.486232 -1.439791 -0.747538
S  -4.402905 0.669754 0.392036
F  -4.084729 0.10513 -2.143095
F  -4.55492 -1.595064 -0.902438
F  -6.091317 -0.15733 -1.38871
O  1.257205 -0.087648 1.17394
O  2.113485 -1.330973 -1.240617
O  4.512822 -1.909994 -1.676281
O  -5.164344 0.054116 1.464915
O  -4.623186 2.055398 0.015498
N  0.697662 1.576529 -0.198679
N  3.469549 2.390784 0.531146
C  3.99396 0.180767 -0.189789
C  3.091346 1.157521 0.228912
C  -0.449636 0.953779 0.252518
C  3.520785 -2.479563 0.707645
C  -2.690118 0.367433 0.623644
C  -0.088056 -0.088219 1.100984
C  1.645402 0.915649 0.353569
C  -1.783673 1.211265 -0.005139
C  -2.315867 -0.686709 1.468357
C  -0.980977 -0.932765 1.7274
C  5.339577 0.508278 -0.27559
C  4.897907 -2.590346 1.327706
C  -4.807515 -0.31755 -1.121734
C  5.731072 1.788757 0.066577
C  4.758078 2.695045 0.451846
H  2.790171 -2.077468 1.40769
H  3.153379 -3.447119 0.355554
H  -2.08501 2.026083 -0.649375
H  -3.063495 -1.31229 1.934948
H  -0.668554 -1.734776 2.380618
H  6.071166 -0.213546 -0.611394
H  5.256357 -1.634153 1.706936
H  5.630779 -2.993938 0.632277
H  4.834537 -3.271848 2.17486
H  6.769068 2.084183 0.020298
H  5.027339 3.710323 0.713267
elementType: S F O N C H
totalener: -2159.91968933 hartree
nucrepener: 2951.25603689 hartree
electener: -5111.17572623 hartree
oneelecener: -8839.71275230 hartree
twoeener: 3728.53702607 hartree
cpcmener: -0.05315884 hartree
kineticenergy: 2153.07040731 hartree
xcener: -159.740328563867 hartree
chargesum: 0.0000000
charge: 0.871027 0.831912 -0.139238 -0.139299 -0.139293 -0.243185 -0.552569 -0.557814 -0.504165 -0.503872 -0.307332 -0.357861 -0.131782 0.159960 0.157745 -0.100881 -0.007835 0.215946 0.405390 -0.220131 -0.060089 -0.207844 -0.049949 -0.278488 0.422621 -0.119985 0.036323 0.130118 0.128062 0.149303 0.153547 0.165507 0.156363 0.104277 0.103050 0.113873 0.168069 0.148518
qa: 0.8710 0.8319 -0.1392 -0.1393 -0.1393 -0.2432 -0.5526 -0.5578 -0.5042 -0.5039 -0.3073 -0.3579 -0.1318 0.1600 0.1577 -0.1009 -0.0078 0.2159 0.4054 -0.2201 -0.0601 -0.2078 -0.0499 -0.2785 0.4226 -0.1200 0.0363 0.1301 0.1281 0.1493 0.1535 0.1655 0.1564 0.1043 0.1031 0.1139 0.1681 0.1485
va: 5.5064 5.5776 1.1813 1.1815 1.1809 2.2970 1.9118 1.9207 1.9935 1.9915 3.1472 3.0878 3.8332 3.7876 3.9211 3.8303 3.7346 3.7630 3.8691 4.2210 3.9620 4.0132 3.9397 3.9530 4.4379 3.9243 4.0309 1.0216 1.0152 1.0228 1.0110 0.9960 1.0082 0.9949 1.0110 1.0007 0.9882 0.9959
dispcorr: -0.020762336 hartree
energy: -2159.940451670589
dipole: 45.45957 -40.76876 4.69081 -6.82496 5.39154 -1.43342 13.63858 -11.11362 2.52496
magnitude: 5.51668 au
magnitude: 14.02230 debye
