program: Orca
programVersion: 5.0.2
elementType: S S F F F O O O O O N N C C C C C C C C C C C C C C C H H H H H H H H H H H
charge: 0
multiplicity: 1
keywords: wb97x-d3
keywords: def2-TZVPP
keywords: def2/J RIJCOSX
keywords: DEFGRID2
keywords: scfconv7
keywords: smallprint printgap noloewdin
keywords: NOSOSCF
formula: C15H11F3N2O5S2
InChI: InChI=1/C15H11F3N2O5S2/c1-2-26(21,22)12-4-3-7-19-13(12)14-20-10-8-9(5-6-11(10)25-14)27(23,24)15(16,17)18/h3-8H,2H2,1H3
38 atoms
S  3.758369 -1.464111 -0.35086
S  -4.171651 -0.664947 -0.299823
F  -4.346228 0.605499 1.978177
F  -5.030861 1.743412 0.277296
F  -6.236773 0.12645 1.047976
O  1.081937 1.591491 -1.0941
O  2.705654 -1.413945 -1.362491
O  5.048956 -2.040893 -0.719316
O  -4.946096 -0.636176 -1.526683
O  -4.036483 -1.879599 0.482294
N  0.905284 0.159688 0.60067
N  3.376458 2.480417 0.378245
C  4.078185 0.214108 0.169539
C  3.099772 1.20475 0.157899
C  -0.329017 0.294452 -0.002866
C  3.158167 -2.303342 1.110168
C  -2.596006 0.068259 -0.563042
C  -0.203889 1.190736 -1.060989
C  1.674297 0.923036 -0.081068
C  -1.550823 -0.293044 0.276724
C  -2.459866 0.967219 -1.630081
C  -1.238265 1.555016 -1.898649
C  5.383776 0.570575 0.471565
C  2.751062 -3.726891 0.776353
C  -5.001339 0.543986 0.832116
C  5.660988 1.898892 0.735685
C  4.627287 2.818356 0.657413
H  3.96858 -2.26878 1.840239
H  2.318535 -1.721709 1.491125
H  -1.664331 -0.997132 1.090281
H  -3.304229 1.201999 -2.263169
H  -1.110122 2.247356 -2.718633
H  6.174617 -0.167412 0.485573
H  3.579485 -4.309285 0.375786
H  1.923729 -3.755159 0.069044
H  2.418694 -4.212943 1.692876
H  6.664779 2.219679 0.975038
H  4.81462 3.871658 0.826067
elementType: S F O N C H
totalener: -2159.91545327 hartree
nucrepener: 2941.77068405 hartree
electener: -5101.68613731 hartree
oneelecener: -8820.95257786 hartree
twoeener: 3719.26644055 hartree
cpcmener: -0.03807436 hartree
kineticenergy: 2153.07022050 hartree
xcener: -159.738505484345 hartree
chargesum: 0.0000000
charge: 0.867882 0.824624 -0.140900 -0.141224 -0.139293 -0.227274 -0.538217 -0.546694 -0.491539 -0.492311 -0.345534 -0.354366 -0.135316 0.181174 0.153025 -0.130025 -0.017533 0.211701 0.432466 -0.224475 -0.051466 -0.213412 -0.047227 -0.262947 0.420439 -0.117865 0.030569 0.128505 0.135427 0.151530 0.150052 0.160478 0.151474 0.100355 0.102494 0.104052 0.164840 0.146530
qa: 0.8679 0.8246 -0.1409 -0.1412 -0.1393 -0.2273 -0.5382 -0.5467 -0.4915 -0.4923 -0.3455 -0.3544 -0.1353 0.1812 0.1530 -0.1300 -0.0175 0.2117 0.4325 -0.2245 -0.0515 -0.2134 -0.0472 -0.2629 0.4204 -0.1179 0.0306 0.1285 0.1354 0.1515 0.1501 0.1605 0.1515 0.1004 0.1025 0.1041 0.1648 0.1465
va: 5.5057 5.5935 1.1795 1.1778 1.1803 2.3290 1.9191 1.9352 2.0089 2.0068 3.0712 3.0689 3.8669 3.7601 3.8738 3.8150 3.7592 3.8125 3.7954 4.1969 3.9526 4.0336 3.9671 3.9458 4.4361 3.9110 4.0359 1.0139 1.0270 1.0219 1.0122 0.9981 1.0164 1.0110 1.0099 1.0002 0.9895 0.9965
dispcorr: -0.020102488 hartree
energy: -2159.935555755117
dipole: 39.07591 -36.15059 2.92532 -9.84635 12.00233 2.15598 0.68132 1.14041 1.82173
magnitude: 4.06503 au
magnitude: 10.33248 debye
