program: Gaussian 09
title: 000053695
version: EM64L-G09RevD.01
frameworkgroup: C1[X(C19H22N5O)]
method: RPBEPBE
basis: SDD
operation: Freq
keyword: #p
keyword: freq=noraman
keyword: PBEPBE/SDD
title: #p freq=noraman PBEPBE/SDD
converged: YES YES NO NO
title: Mulliken charges:
elementType: O N N N N N C C C C C C C C C C C C C C C C C C C H H H H H H H H H H H H H H H H H H H H H H
charge: -0.444239 -0.104509 -0.452882 -0.431397 -0.488768 -0.100471 -0.576252 0.265343 0.512844 0.100708 0.207532 -0.410535 -0.365126 -0.370041 0.215197 -0.445299 -0.303983 0.030671 -0.351714 -0.245045 -0.210598 -0.250811 -0.203889 -0.341899 -0.166294 0.261484 0.265580 0.225445 0.310071 0.265001 0.263079 0.263654 0.263177 0.360183 0.381774 0.327609 0.256861 0.216401 0.197892 0.251204 0.242668 0.245758 0.206613 0.369401 0.258121 0.246330 0.253151
chargesum: 1.00000
title: Mulliken charges with hydrogens summed into heavy atoms:
elementType: O N N N N N C C C C C C C C C C C C C C C C C C C
charge: -0.074837 -0.104509 -0.092699 -0.049623 -0.161160 -0.100471 -0.049188 0.265343 0.512844 0.100708 0.207532 0.124981 0.162955 0.156790 0.215197 -0.188438 0.110310 0.030671 -0.100511 -0.002377 0.035160 -0.044198 0.054232 -0.095569 0.086857
polarizability: 3.40825615e+02 5.21865713e+01 2.72847117e+02 3.63449261e+00 2.99855952e+01 1.56508138e+02
1716.lowfreq: -6.1882 -5.4862 -0.0008 0.0003 0.0005 6.1109 18.0121 24.6838 28.4098
frequency: 17.7172 24.5723 28.3850 52.5089 57.3835 71.1754 75.5428 91.6725 106.4004 111.4352 135.2829 143.7036 172.5685 193.0580 209.3439 256.2740 284.7331 287.3836 293.6823 309.5462 325.0577 355.2572 376.3761 384.8284 400.6151 413.1053 434.1225 503.9000 540.5673 550.0083 556.7487 558.3968 569.9374 576.8612 611.6407 621.1167 639.1143 681.3384 685.0988 696.5263 715.1145 738.9163 753.7013 763.3340 780.9180 796.3893 802.3019 823.4314 862.1117 868.7479 873.7381 885.0610 887.8166 932.2311 945.7163 955.9655 963.3690 966.2110 978.9002 986.1946 1002.7825 1004.8315 1009.0057 1015.0200 1024.6343 1042.2636 1061.9497 1084.7975 1096.7107 1109.5416 1123.1438 1138.2192 1152.4995 1175.0724 1179.6841 1193.8603 1200.7853 1212.4543 1218.8433 1224.0549 1241.6169 1265.6240 1269.7885 1277.4786 1287.7644 1308.7183 1310.0362 1314.8307 1324.7646 1331.5476 1347.7935 1358.7376 1380.8057 1408.2019 1412.0287 1412.6370 1424.3825 1427.3223 1451.2360 1458.4022 1467.5396 1485.7997 1487.7857 1490.8231 1508.3989 1515.5620 1538.8871 1542.0837 1572.0316 1581.4791 1586.8245 1627.8351 1676.1561 2940.0173 2996.6383 2999.2641 3015.6631 3020.1254 3022.9840 3079.3102 3095.1844 3097.5163 3111.3221 3120.8107 3130.5360 3140.6198 3144.0355 3155.6211 3163.3923 3174.6826 3183.6883 3474.8614 3590.0287 3608.8814 3623.8248
redmass: 4.7440 4.6732 6.1408 4.4736 4.7717 5.0312 2.0440 2.3369 3.5720 4.4757 4.5299 4.7235 5.0791 4.7763 3.9619 2.4380 1.1150 4.1794 5.8441 4.0662 5.0234 4.4697 2.1274 3.0866 3.3067 1.5777 3.0720 3.5018 3.6513 1.2451 2.2227 1.5670 3.4215 6.4644 4.5344 6.8587 5.1196 8.4896 5.8270 5.0507 3.4858 1.6763 3.4417 1.5042 3.9604 3.7316 3.2812 1.1603 1.3948 1.3198 4.6660 1.3816 4.6378 3.6300 1.3710 3.1440 1.4379 4.6480 3.3761 1.3127 1.3588 4.4143 2.7582 2.1803 2.8101 3.0290 2.7627 2.3719 1.8435 1.7359 1.7708 1.6613 2.3918 1.1629 1.1388 2.3077 1.1566 1.2782 1.1360 1.2622 2.1523 1.6374 1.1777 1.4604 1.4003 1.5128 1.4645 5.6807 1.3132 3.0137 1.4381 1.5370 1.3717 1.8339 2.0232 2.2747 1.5483 2.3833 1.7957 1.6876 2.8971 2.7498 1.2634 1.1149 1.0886 1.0914 6.0545 3.2352 6.1077 5.8592 5.4093 6.7996 5.1933 1.0587 1.0821 1.0871 1.0610 1.0656 1.0683 1.1029 1.0959 1.1067 1.0974 1.0886 1.0907 1.0891 1.0884 1.0940 1.0936 1.0997 1.1010 1.0836 1.0671 1.0802 1.0809
irintensity: 1.5257 0.4345 2.7618 0.8305 1.4686 0.4012 0.2137 9.2008 2.3693 0.7781 6.0061 0.9237 0.6809 3.0398 9.0486 2.8511 144.6482 1.3328 5.4986 7.2748 6.0545 5.3879 38.6366 2.0562 2.3133 49.2707 9.3632 9.5074 25.8790 55.7406 33.6621 92.9766 9.8408 7.1081 2.6105 2.4460 4.7138 9.8472 4.3222 1.5226 5.7577 43.2692 13.5621 97.4045 33.2360 9.7844 20.0345 5.0372 3.4119 3.5214 9.0577 0.6562 32.0124 19.3625 6.0071 25.5141 0.3393 4.4557 73.8448 0.4841 0.0273 7.5778 12.2475 2.8837 6.2309 3.5485 3.9943 15.4751 12.0044 4.0795 2.3771 12.4122 46.6703 0.8645 1.9058 1.2440 3.7377 22.1686 16.3582 5.2849 7.9701 18.8252 6.2484 27.9058 23.3474 63.9673 11.0601 0.7499 11.9831 15.2095 21.7960 45.6449 2.1220 25.4348 20.0648 21.8181 3.7289 36.2082 6.8117 25.8531 56.9528 1.0251 18.7566 1.5406 4.8851 17.5030 34.6931 134.5835 1.9075 59.4918 35.7281 2.4876 534.4325 51.4198 20.2460 38.3057 24.1705 40.4977 24.2951 4.2331 0.5960 19.1354 16.7063 6.7851 20.1405 8.2688 0.0351 12.0817 10.1505 15.4009 8.0128 502.2800 20.2320 54.4411 72.3759
temp: 298.150 k
press: 1.00000 atm
elementType: 8 7 7 7 7 7 6 6 6 6 6 6 6 6 6 6 6 6 6 6 6 6 6 6 6 1 1 1 1 1 1 1 1 1 1 1 1 1 1 1 1 1 1 1 1 1 1
symmnumber: 1
zpe: 1016450.4 jmol-1
zpe.correction: 0.387146 hartree
zpe.thermalcorrener: 0.409740 hartree
zpe.thermalcorrenthalpy: 0.410684 hartree
zpe.thermalcorrgfe: 0.332994 hartree
zpe.sumelectzpe: -1084.206110 hartree
zpe.sumelectthermal: -1084.183515 hartree
zpe.sumelectthermalent: -1084.182571 hartree
zpe.sumelectthermalfe: -1084.260261 hartree
dipole: 0.9812 -3.9000 2.4407
dipole: 4.7042
quadrupole: -103.0053 -78.3323 -129.3917
quadrupole: -5.4424 -9.4974 3.9564
quadrupole: 0.5711 25.2442 -25.8153 -5.4424 -9.4974 3.9564
hfenergy: -1084.5932551 hartree
pointgroup: C01[X(C19H22N5O1)]
dipole: -0.4846337 -1.4895391 -0.9858056 debye
polarizability: 338.9387178|-54.6952787|275.8354733|-15.2337387|-20.1349776|155.4066798 unknown
InChI: InChI=1S/C19H22N5O/c25-12-11-24(19-21-9-10-22-19)13-15-14-5-1-2-6-16(14)23-18(15)17-7-3-4-8-20-17/h1-8,21-23,25H,9-13H2
charge 1 multiplicity 1
47 atoms
O  -4.749295 -1.908235 1.601371
N  -1.274832 -1.271437 0.445551
N  -1.666082 -2.970187 -1.220289
N  0.454199 -2.40348 -0.809464
N  1.794755 2.023692 -0.423522
N  -1.8219 1.981083 0.463441
C  -0.318239 -0.524686 1.34802
C  0.713053 0.333717 0.662387
C  -0.845368 -2.160467 -0.475835
C  2.121152 -0.006581 0.556292
C  0.544921 1.605323 0.066397
C  -2.72857 -1.091042 0.683423
C  -0.90727 -3.742383 -2.237292
C  0.576476 -3.497552 -1.806671
C  2.772231 1.068906 -0.143907
C  2.907758 -1.109948 1.002748
C  -3.300227 -2.066932 1.732164
C  -0.63786 2.475003 -0.03855
C  4.154616 1.065908 -0.428956
C  4.287433 -1.116301 0.722247
C  4.902842 -0.044265 0.00869
C  -0.567986 3.778864 -0.60823
C  -1.727545 4.576708 -0.667156
C  -2.931162 2.76922 0.405417
C  -2.940484 4.067754 -0.150798
H  0.191774 -1.266779 1.992638
H  -0.965109 0.098587 1.983382
H  -3.292209 -1.214798 -0.260028
H  -2.870879 -0.044934 0.99054
H  -1.111578 -3.357192 -3.25209
H  -1.174833 -4.810465 -2.201477
H  1.025824 -4.394233 -1.345028
H  1.204871 -3.184705 -2.655768
H  -2.679123 -2.99731 -1.136375
H  1.251497 -1.8568 -0.471473
H  1.970609 2.902958 -0.904666
H  2.469264 -1.922324 1.595183
H  -2.94246 -1.800985 2.748395
H  -2.988757 -3.111819 1.513367
H  4.636294 1.894292 -0.958743
H  4.907554 -1.948619 1.070669
H  5.979092 -0.080083 -0.187785
H  0.371281 4.186786 -0.99534
H  -5.220402 -2.346952 2.352413
H  -1.684363 5.579453 -1.103212
H  -3.848959 2.337349 0.821476
H  -3.863101 4.653894 -0.174356
