program: Orca
programVersion: 5.0.2
elementType: S S S S N N C C C C H H H H H H H H
charge: 0
multiplicity: 1
keywords: wb97x-d3
keywords: def2-TZVPP
keywords: def2/J RIJCOSX
keywords: DEFGRID2
keywords: scfconv7
keywords: smallprint printgap noloewdin
keywords: NOSOSCF
formula: C4H8N2S4
InChI: InChI=1/C4H8N2S4/c7-3(8)5-1-2-6-4(9)10/h5-7,9H,1-2H2
18 atoms
S  -3.341738 0.955906 -1.12491
S  2.373355 1.6882 0.481135
S  -1.524179 0.566747 1.225023
S  2.483376 -1.192705 1.305808
N  -1.646804 -0.978354 -0.938975
N  1.281269 -0.23274 -0.853888
C  -0.56667 -1.854394 -0.537932
C  0.743973 -1.521146 -1.23163
C  -2.070123 0.080256 -0.257569
C  1.979625 -0.018865 0.254196
H  -0.455949 -1.807987 0.542911
H  -0.846504 -2.873297 -0.804519
H  1.474928 -2.292589 -0.995561
H  0.608508 -1.514487 -2.312504
H  -2.038818 -1.167962 -1.852011
H  0.957925 0.558908 -1.394361
H  -3.532619 1.881129 -0.179622
H  3.083721 1.511947 1.599796
elementType: S N C H
totalener: -1859.60414179 hartree
nucrepener: 904.07341787 hartree
electener: -2763.67755966 hartree
oneelecener: -4361.36179232 hartree
twoeener: 1597.68423266 hartree
cpcmener: -0.03496235 hartree
kineticenergy: 1855.79765761 hartree
xcener: -102.655662014519 hartree
chargesum: -0.0000000
charge: -0.094586 -0.087490 -0.418458 -0.424338 -0.123319 -0.126452 -0.002809 -0.015831 0.105466 0.114105 0.091242 0.119051 0.099072 0.121140 0.172005 0.179513 0.146644 0.145044
qa: -0.0946 -0.0875 -0.4185 -0.4243 -0.1233 -0.1265 -0.0028 -0.0158 0.1055 0.1141 0.0912 0.1191 0.0991 0.1211 0.1720 0.1795 0.1466 0.1450
va: 2.2790 2.2842 2.0063 1.9999 3.2607 3.2702 3.7849 3.8267 4.3427 4.3332 1.0579 1.0095 1.0413 1.0062 1.0051 1.0023 1.0248 1.0249
dispcorr: -0.008342353 hartree
energy: -1859.612484142145
dipole: -0.52560 -0.53043 -1.05604 -5.49280 5.07458 -0.41822 -5.42832 2.16396 -3.26436
magnitude: 3.45632 au
magnitude: 8.78527 debye
