program: Orca
programVersion: 5.0.2
elementType: S S S S N N C C C C H H H H H H H H
charge: 0
multiplicity: 1
keywords: wb97x-d3
keywords: def2-TZVPP
keywords: def2/J RIJCOSX
keywords: DEFGRID2
keywords: scfconv7
keywords: smallprint printgap noloewdin
keywords: NOSOSCF
formula: C4H8N2S4
InChI: InChI=1/C4H8N2S4/c7-3(8)5-1-2-6-4(9)10/h5-7,9H,1-2H2
18 atoms
S  -4.008222 0.391046 -1.492913
S  4.007382 -0.390929 1.493588
S  -2.983722 0.070933 1.309487
S  2.984299 -0.071962 -1.309437
N  -1.593752 -0.331651 -0.91246
N  1.594052 0.334388 0.911649
C  -0.374766 -0.634059 -0.195456
C  0.37547 0.636912 0.193983
C  -2.736018 0.009015 -0.326011
C  2.736083 -0.008305 0.325912
H  -0.620062 -1.216569 0.691704
H  0.242927 -1.249022 -0.847286
H  0.621259 1.219192 -0.693198
H  -0.242384 1.252139 0.845415
H  -1.517048 -0.301988 -1.920704
H  1.516903 0.305464 1.919886
H  -4.944774 0.662985 -0.578535
H  4.943765 -0.665405 0.579797
elementType: S N C H
totalener: -1859.60447131 hartree
nucrepener: 848.29201674 hartree
electener: -2707.89648805 hartree
oneelecener: -4249.11199001 hartree
twoeener: 1541.21550195 hartree
cpcmener: -0.02635842 hartree
kineticenergy: 1855.77980290 hartree
xcener: -102.651146369919 hartree
chargesum: -0.0000000
charge: -0.086981 -0.086963 -0.424716 -0.424698 -0.127201 -0.127224 -0.019196 -0.019136 0.110955 0.110965 0.101334 0.120495 0.101375 0.120457 0.178152 0.178155 0.147118 0.147109
qa: -0.0870 -0.0870 -0.4247 -0.4247 -0.1272 -0.1272 -0.0192 -0.0191 0.1110 0.1110 0.1013 0.1205 0.1014 0.1205 0.1782 0.1782 0.1471 0.1471
va: 2.2869 2.2869 1.9940 1.9940 3.2760 3.2760 3.7614 3.7615 4.3312 4.3312 1.0422 1.0214 1.0422 1.0214 1.0033 1.0033 1.0234 1.0234
dispcorr: -0.006807938 hartree
energy: -1859.611279247572
dipole: 0.00036 -0.00083 -0.00047 0.00437 -0.00228 0.00209 -0.00242 0.00179 -0.00063
magnitude: 0.00223 au
magnitude: 0.00566 debye
