program: Orca
programVersion: 5.0.2
elementType: S S S S N N C C C C H H H H H H H H
charge: 0
multiplicity: 1
keywords: wb97x-d3
keywords: def2-TZVPP
keywords: def2/J RIJCOSX
keywords: DEFGRID2
keywords: scfconv7
keywords: smallprint printgap noloewdin
keywords: NOSOSCF
formula: C4H8N2S4
InChI: InChI=1/C4H8N2S4/c7-3(8)5-1-2-6-4(9)10/h5-7,9H,1-2H2
18 atoms
S  -3.38894 0.927252 -1.14152
S  2.445294 1.674561 0.473786
S  -1.573701 0.573356 1.218871
S  2.518897 -1.210329 1.299803
N  -1.646151 -0.963452 -0.953693
N  1.276529 -0.224551 -0.825806
C  -0.57525 -1.843133 -0.537286
C  0.744297 -1.509471 -1.218104
C  -2.097589 0.082748 -0.269102
C  2.013574 -0.026713 0.260515
H  -0.474686 -1.792614 0.545016
H  -0.856609 -2.862536 -0.803282
H  1.473336 -2.283077 -0.979496
H  0.618751 -1.495558 -2.300933
H  -2.045656 -1.168871 -1.860616
H  0.97581 0.569938 -1.372489
H  -3.606439 1.849739 -0.198223
H  3.161792 1.491262 1.587948
elementType: S N C H
totalener: -1859.60952279 hartree
nucrepener: 899.88479416 hartree
electener: -2759.49431695 hartree
oneelecener: -4352.99661729 hartree
twoeener: 1593.50230034 hartree
cpcmener: -0.02988866 hartree
kineticenergy: 1855.78653191 hartree
xcener: -102.653467441750 hartree
chargesum: -0.0000000
charge: -0.096627 -0.088392 -0.403448 -0.412524 -0.125961 -0.121406 -0.003589 -0.023884 0.103420 0.111267 0.094339 0.116584 0.100008 0.117965 0.166775 0.174203 0.146512 0.144757
qa: -0.0966 -0.0884 -0.4034 -0.4125 -0.1260 -0.1214 -0.0036 -0.0239 0.1034 0.1113 0.0943 0.1166 0.1000 0.1180 0.1668 0.1742 0.1465 0.1448
va: 2.2766 2.2829 2.0213 2.0117 3.2476 3.2616 3.7819 3.8328 4.3428 4.3338 1.0570 1.0099 1.0427 1.0065 1.0083 1.0056 1.0249 1.0249
dispcorr: -0.008250818 hartree
energy: -1859.617773608785
dipole: -0.53961 -0.46001 -0.99961 -5.43881 5.04723 -0.39157 -5.38466 2.28841 -3.09626
magnitude: 3.27710 au
magnitude: 8.32971 debye
