program: Orca
programVersion: 5.0.2
elementType: S S S S N N C C C C H H H H H H H H
charge: 0
multiplicity: 1
keywords: wb97x-d3
keywords: def2-TZVPP
keywords: def2/J RIJCOSX
keywords: DEFGRID2
keywords: scfconv7
keywords: smallprint printgap noloewdin
keywords: NOSOSCF
formula: C4H8N2S4
InChI: InChI=1/C4H8N2S4/c7-3(8)5-1-2-6-4(9)10/h5-7,9H,1-2H2
18 atoms
S  -4.012995 0.38576 -1.495175
S  4.012169 -0.385564 1.495885
S  -2.990729 0.07048 1.310479
S  2.991273 -0.071725 -1.310414
N  -1.595431 -0.320931 -0.909634
N  1.595726 0.323704 0.908823
C  -0.378515 -0.633023 -0.194876
C  0.379228 0.635902 0.193372
C  -2.74109 0.011078 -0.323826
C  2.741153 -0.010385 0.323739
H  -0.625134 -1.214217 0.693421
H  0.235866 -1.250772 -0.848075
H  0.626365 1.216854 -0.694944
H  -0.235324 1.253923 0.846156
H  -1.521864 -0.296918 -1.918143
H  1.521728 0.300514 1.917325
H  -4.952654 0.658523 -0.58411
H  4.95162 -0.661019 0.585417
elementType: S N C H
totalener: -1859.61010320 hartree
nucrepener: 847.71347434 hartree
electener: -2707.32357754 hartree
oneelecener: -4248.00003594 hartree
twoeener: 1540.67645840 hartree
cpcmener: -0.02307994 hartree
kineticenergy: 1855.77805780 hartree
xcener: -102.650844808998 hartree
chargesum: -0.0000000
charge: -0.087689 -0.087674 -0.414472 -0.414458 -0.129142 -0.129156 -0.021903 -0.021827 0.111176 0.111194 0.101275 0.120141 0.101320 0.120066 0.174119 0.174123 0.146459 0.146450
qa: -0.0877 -0.0877 -0.4145 -0.4145 -0.1291 -0.1292 -0.0219 -0.0218 0.1112 0.1112 0.1013 0.1201 0.1013 0.1201 0.1741 0.1741 0.1465 0.1465
va: 2.2857 2.2857 2.0051 2.0051 3.2684 3.2683 3.7619 3.7621 4.3296 4.3296 1.0427 1.0218 1.0426 1.0217 1.0060 1.0060 1.0237 1.0237
dispcorr: -0.006803535 hartree
energy: -1859.616906736105
dipole: 0.00040 -0.00081 -0.00041 0.00459 -0.00241 0.00218 -0.00250 0.00188 -0.00062
magnitude: 0.00230 au
magnitude: 0.00585 debye
