program: Orca
programVersion: 5.0.2
elementType: Cl Cl Cl Cl Cl O C C C C C C C C C C C C C C H H H H H H H H H
charge: 0
multiplicity: 1
keywords: wb97x-d3
keywords: def2-TZVPP
keywords: def2/J RIJCOSX
keywords: DEFGRID2
keywords: scfconv7
keywords: smallprint printgap noloewdin
keywords: NOSOSCF
formula: C14H9Cl5O
InChI: InChI=1/C14H9Cl5O/c15-11-5-1-9(2-6-11)13(20,14(17,18)19)10-3-7-12(16)8-4-10/h1-8,20H
29 atoms
Cl 0.325829 -1.858342 -1.833283
Cl -1.165123 -3.173236 0.268628
Cl 1.665619 -2.861321 0.475489
Cl -5.026375 2.543194 -0.189874
Cl 4.661005 2.940304 -0.37873
O  0.012249 -1.029411 2.048449
C  -0.014686 -0.715933 0.687409
C  -1.31698 0.026476 0.371449
C  1.169884 0.203079 0.416929
C  0.19202 -2.070238 -0.086028
C  -2.244256 -0.279786 -0.616436
C  2.261438 0.225981 1.278042
C  -1.570901 1.132776 1.185939
C  1.174222 1.048739 -0.687456
C  -3.386581 0.490727 -0.789043
C  3.337222 1.065242 1.036758
C  -2.701696 1.908711 1.022163
C  2.245627 1.886581 -0.942439
C  -3.611358 1.58165 0.028038
C  3.325288 1.889933 -0.075094
H  -2.113597 -1.117686 -1.281875
H  2.284787 -0.407241 2.152362
H  -0.863491 1.404704 1.95825
H  0.32603 1.076942 -1.357684
H  -0.798597 -1.495244 2.279349
H  -4.096272 0.233414 -1.562784
H  4.179359 1.076589 1.714551
H  -2.873414 2.763561 1.661294
H  2.234116 2.539412 -1.803859
totalener: -2915.21758264 hartree
nucrepener: 2267.84510647 hartree
electener: -5183.06268910 hartree
oneelecener: -8526.50541013 hartree
twoeener: 3343.44272103 hartree
kineticenergy: 2909.37500380 hartree
xcener: -165.759392637314 hartree
chargesum: -0.0000000
charge: -0.040375 -0.063175 -0.023156 -0.068854 -0.073360 -0.307344 0.414180 -0.088081 -0.028544 0.159153 -0.113731 -0.158321 -0.187032 -0.204372 -0.160211 -0.141541 -0.149699 -0.149470 0.110451 0.093601 0.109443 0.135931 0.129271 0.138756 0.179949 0.120434 0.120866 0.124535 0.120695
qa: -0.0404 -0.0632 -0.0232 -0.0689 -0.0734 -0.3073 0.4142 -0.0881 -0.0285 0.1592 -0.1137 -0.1583 -0.1870 -0.2044 -0.1602 -0.1415 -0.1497 -0.1495 0.1105 0.0936 0.1094 0.1359 0.1293 0.1388 0.1799 0.1204 0.1209 0.1245 0.1207
va: 1.2694 1.2508 1.2809 1.2381 1.2334 2.1030 3.9155 3.6252 3.5817 4.4380 3.9356 4.0543 4.0977 4.0590 4.1226 4.0324 4.0266 4.0862 3.9327 3.9362 1.0606 1.0342 1.0196 0.9993 1.0640 1.0159 1.0140 1.0124 1.0144
dispcorr: -0.018417231 hartree
energy: -2915.235999868242
dipole: -2.23839 1.80729 -0.43110 8.89377 -9.08893 -0.19516 5.72696 -5.52753 0.19944
magnitude: 0.51353 au
magnitude: 1.30528 debye
